BDBM61995 4-chloranyl-2-[(2-methoxyphenyl)carbonylamino]benzoic acid::4-chloro-2-(o-anisoylamino)benzoic acid::4-chloro-2-[(2-methoxybenzoyl)amino]benzoic acid::4-chloro-2-[[(2-methoxyphenyl)-oxomethyl]amino]benzoic acid::KSC-6-274::KUC105798N::cid_16777607
SMILES COc1ccccc1C(=O)Nc1cc(Cl)ccc1C(O)=O
InChI Key InChIKey=FVJWJWDUBOPNQB-UHFFFAOYSA-N
Data  2 IC50
  Tab Delimited (TSV)   2D SDfile   Computed 3D by Vconf -m prep SDfile
Find this compound or compounds like it in BindingDB:
Activity Spreadsheet -- Enzyme Inhibition Constant Data from BindingDB
Found 2 hits for monomerid = 61995
TargetPhosphotransferase(Trypanosoma brucei)
University Of Pittsburgh
Curated by PubChem BioAssay
LigandPNGBDBM61995(4-chloranyl-2-[(2-methoxyphenyl)carbonylamino]benz...)
Affinity DataIC50:  2.50E+4nM. Assay description: Excerpt from MH0882340 application (Dr. James Morris, Clemson University) Trypanosoma brucei, the digenic protozoan parasite that causes African slee...
In DepthDetails PCBioAssay
TargetGlucose-6-phosphate 1-dehydrogenase(Leuconostoc mesenteroides)
University Of Pittsburgh
Curated by PubChem BioAssay
LigandPNGBDBM61995(4-chloranyl-2-[(2-methoxyphenyl)carbonylamino]benz...)
Affinity DataIC50: >2.50E+4nM. Assay description: Excerpt from MH082340 application (Dr. James Morris, Clemson University) Trypanosoma brucei, the digenic protozoan parasite that causes African sleep...
In DepthDetails PCBioAssay