BDBM62035 2-(1,3-benzodioxol-5-ylcarbonylamino)-4-chloranyl-benzoic acid::2-(1,3-benzodioxole-5-carbonylamino)-4-chlorobenzoic acid::2-[[1,3-benzodioxol-5-yl(oxo)methyl]amino]-4-chlorobenzoic acid::4-chloro-2-(piperonyloylamino)benzoic acid::KSC-09-199B::KUC106004N::cid_16777892
SMILES OC(=O)c1ccc(Cl)cc1NC(=O)c1ccc2OCOc2c1
InChI Key InChIKey=YQBGXUBGOZWFDN-UHFFFAOYSA-N
Data  2 IC50
  Tab Delimited (TSV)   2D SDfile   Computed 3D by Vconf -m prep SDfile
Find this compound or compounds like it in BindingDB:
Activity Spreadsheet -- Enzyme Inhibition Constant Data from BindingDB
Found 2 hits for monomerid = 62035
TargetPhosphotransferase(Trypanosoma brucei)
University Of Pittsburgh
Curated by PubChem BioAssay
LigandPNGBDBM62035(2-(1,3-benzodioxol-5-ylcarbonylamino)-4-chloranyl-...)
Affinity DataIC50:  9.43E+3nM. Assay description: Excerpt from MH0882340 application (Dr. James Morris, Clemson University) Trypanosoma brucei, the digenic protozoan parasite that causes African slee...
In DepthDetails PCBioAssay
TargetGlucose-6-phosphate 1-dehydrogenase(Leuconostoc mesenteroides)
University Of Pittsburgh
Curated by PubChem BioAssay
LigandPNGBDBM62035(2-(1,3-benzodioxol-5-ylcarbonylamino)-4-chloranyl-...)
Affinity DataIC50: >2.50E+4nM. Assay description: Excerpt from MH082340 application (Dr. James Morris, Clemson University) Trypanosoma brucei, the digenic protozoan parasite that causes African sleep...
In DepthDetails PCBioAssay