BDBM62054 4-chloranyl-2-[(4-phenylphenyl)carbonylamino]benzoic acid::4-chloro-2-[(4-phenylbenzoyl)amino]benzoic acid::4-chloro-2-[[oxo-(4-phenylphenyl)methyl]amino]benzoic acid::KSC-20-024::KUC106493N::cid_46856249
SMILES OC(=O)c1ccc(Cl)cc1NC(=O)c1ccc(cc1)-c1ccccc1
InChI Key InChIKey=DNDDUVFOUSQONQ-UHFFFAOYSA-N
Data  2 IC50
  Tab Delimited (TSV)   2D SDfile   Computed 3D by Vconf -m prep SDfile
Find this compound or compounds like it in BindingDB:
Activity Spreadsheet -- Enzyme Inhibition Constant Data from BindingDB
Found 2 hits for monomerid = 62054
TargetPhosphotransferase(Trypanosoma brucei)
University Of Pittsburgh
Curated by PubChem BioAssay
LigandPNGBDBM62054(4-chloranyl-2-[(4-phenylphenyl)carbonylamino]benzo...)
Affinity DataIC50:  2.23E+4nM. Assay description: Excerpt from MH0882340 application (Dr. James Morris, Clemson University) Trypanosoma brucei, the digenic protozoan parasite that causes African slee...
In DepthDetails PCBioAssay
TargetGlucose-6-phosphate 1-dehydrogenase(Leuconostoc mesenteroides)
University Of Pittsburgh
Curated by PubChem BioAssay
LigandPNGBDBM62054(4-chloranyl-2-[(4-phenylphenyl)carbonylamino]benzo...)
Affinity DataIC50: >2.50E+4nM. Assay description: Excerpt from MH082340 application (Dr. James Morris, Clemson University) Trypanosoma brucei, the digenic protozoan parasite that causes African sleep...
In DepthDetails PCBioAssay