BDBM62092 2-furancarboxylic acid [4-[[[2-(4-methylanilino)-1-oxoethyl]hydrazinylidene]methyl]phenyl] ester::4-(2-{[(4-methylphenyl)amino]acetyl}carbonohydrazonoyl)phenyl 2-furoate (non-preferred name)::MLS000577439::SMR000186068::[4-[[2-[(4-methylphenyl)amino]ethanoylhydrazinylidene]methyl]phenyl] furan-2-carboxylate::[4-[[[2-(4-methylanilino)acetyl]hydrazinylidene]methyl]phenyl] furan-2-carboxylate::cid_1367260::furan-2-carboxylic acid [4-[[[2-(p-toluidino)acetyl]hydrazono]methyl]phenyl] ester
SMILES Cc1ccc(NCC(=O)NN=Cc2ccc(OC(=O)c3ccco3)cc2)cc1
InChI Key InChIKey=VUKXBMBHHHCPNV-UHFFFAOYSA-N
Data  1 IC50
  Tab Delimited (TSV)   2D SDfile   Computed 3D by Vconf -m prep SDfile
Find this compound or compounds like it in BindingDB:
Activity Spreadsheet -- Enzyme Inhibition Constant Data from BindingDB
Found 1 hit for monomerid = 62092
TargetNeuropeptides B/W receptor type 1(Homo sapiens (Human))
The Scripps Research Institute Molecular Screening Center
Curated by PubChem BioAssay
LigandPNGBDBM62092(2-furancarboxylic acid [4-[[[2-(4-methylanilino)-1...)
Affinity DataIC50:  4.38E+4nM. Assay description: Source (MLPCN Center Name): The Scripps Research Institute Molecular Screening Center (SRIMSC) Affiliation: The Scripps Research Institute, TSRI Assa...
In DepthDetails PCBioAssay