BDBM62104 MLS000676981::N-[2-(1-cyclohexen-1-yl)ethyl]-2-(4-nitrophenoxy)acetamide::N-[2-(1-cyclohexenyl)ethyl]-2-(4-nitrophenoxy)acetamide::N-[2-(cyclohexen-1-yl)ethyl]-2-(4-nitrophenoxy)acetamide::N-[2-(cyclohexen-1-yl)ethyl]-2-(4-nitrophenoxy)ethanamide::SMR000271158::cid_675719
SMILES [O-][N+](=O)c1ccc(OCC(=O)NCCC2=CCCCC2)cc1
InChI Key InChIKey=HULZOGAIIIXOPX-UHFFFAOYSA-N
Data  1 IC50
  Tab Delimited (TSV)   2D SDfile   Computed 3D by Vconf -m prep SDfile
Find this compound or compounds like it in BindingDB:
Activity Spreadsheet -- Enzyme Inhibition Constant Data from BindingDB
Found 1 hit for monomerid = 62104
TargetNeuropeptides B/W receptor type 1(Homo sapiens (Human))
The Scripps Research Institute Molecular Screening Center
Curated by PubChem BioAssay
LigandPNGBDBM62104(MLS000676981 | N-[2-(1-cyclohexen-1-yl)ethyl]-2-(4...)
Affinity DataIC50:  1.46E+4nM. Assay description: Source (MLPCN Center Name): The Scripps Research Institute Molecular Screening Center (SRIMSC) Affiliation: The Scripps Research Institute, TSRI Assa...
In DepthDetails PCBioAssay