BDBM62155 Furan-2-carboxylic acid [cyclohexylcarbamoyl-(3,4,5-trimethoxy-phenyl)-methyl]-(2-methoxy-phenyl)-amide::MLS001220116::N-[2-(cyclohexylamino)-2-keto-1-(3,4,5-trimethoxyphenyl)ethyl]-N-(2-methoxyphenyl)-2-furamide::N-[2-(cyclohexylamino)-2-oxidanylidene-1-(3,4,5-trimethoxyphenyl)ethyl]-N-(2-methoxyphenyl)furan-2-carboxamide::N-[2-(cyclohexylamino)-2-oxo-1-(3,4,5-trimethoxyphenyl)ethyl]-N-(2-methoxyphenyl)-2-furancarboxamide::N-[2-(cyclohexylamino)-2-oxo-1-(3,4,5-trimethoxyphenyl)ethyl]-N-(2-methoxyphenyl)furan-2-carboxamide::SMR000600212::cid_3191330
SMILES COc1cc(cc(OC)c1OC)C(N(C(=O)c1ccco1)c1ccccc1OC)C(=O)NC1CCCCC1
InChI Key InChIKey=VMJPUMWEHNWILM-UHFFFAOYSA-N
Data  1 IC50
  Tab Delimited (TSV)   2D SDfile   Computed 3D by Vconf -m prep SDfile
Find this compound or compounds like it in BindingDB:
Activity Spreadsheet -- Enzyme Inhibition Constant Data from BindingDB
Found 1 hit for monomerid = 62155
TargetNeuropeptides B/W receptor type 1(Homo sapiens (Human))
The Scripps Research Institute Molecular Screening Center
Curated by PubChem BioAssay
LigandPNGBDBM62155(Furan-2-carboxylic acid [cyclohexylcarbamoyl-(3,4,...)
Affinity DataIC50:  4.38E+4nM. Assay description: Source (MLPCN Center Name): The Scripps Research Institute Molecular Screening Center (SRIMSC) Affiliation: The Scripps Research Institute, TSRI Assa...
In DepthDetails PCBioAssay