BDBM62268 MLS-0377038.0001::N-[1-(4-tert-butylphenyl)-4,5,6,7-tetrahydroindazol-4-yl]-1,5-dimethyl-3-pyrazolecarboxamide::N-[1-(4-tert-butylphenyl)-4,5,6,7-tetrahydroindazol-4-yl]-1,5-dimethyl-pyrazole-3-carboxamide::N-[1-(4-tert-butylphenyl)-4,5,6,7-tetrahydroindazol-4-yl]-1,5-dimethylpyrazole-3-carboxamide::cid_24792000
SMILES Cc1cc(nn1C)C(=O)NC1CCCc2c1cnn2-c1ccc(cc1)C(C)(C)C
InChI Key InChIKey=SETHRHYPFROKGS-UHFFFAOYSA-N
Data  4 IC50
  Tab Delimited (TSV)   2D SDfile   Computed 3D by Vconf -m prep SDfile
Find this compound or compounds like it in BindingDB:
Activity Spreadsheet -- Enzyme Inhibition Constant Data from BindingDB
Found 4 hits for monomerid = 62268
TargetNucleotide-binding oligomerization domain-containing protein 1(Homo sapiens (Human))
Burnham Center For Chemical Genomics
Curated by PubChem BioAssay
LigandPNGBDBM62268(MLS-0377038.0001 | N-[1-(4-tert-butylphenyl)-4,5,6...)
Affinity DataIC50:  1.33E+3nM. Assay description: Data Source: Sanford-Burnham Center for Chemical Genomics (SBCCG) Source Affiliation: Sanford-Burnham Medical Research Institute (SBMRI, San Diego, C...
In DepthDetails PCBioAssay
TargetTegument protein VP16(Human herpesvirus 1 (strain 17) (HHV-1) (Human her...)
The Scripps Research Institute Molecular Screening Center
Curated by PubChem BioAssay
LigandPNGBDBM62268(MLS-0377038.0001 | N-[1-(4-tert-butylphenyl)-4,5,6...)
Affinity DataIC50:  8.54E+4nM. Assay description: Source (MLPCN Center Name): The Scripps Research Institute Molecular Screening Center Affiliation: The Scripps Research Institute, TSRI Assay Provide...
In DepthDetails PCBioAssay
TargetCOUP transcription factor 2(Homo sapiens (Human))
The Scripps Research Institute Molecular Screening Center
Curated by PubChem BioAssay
LigandPNGBDBM62268(MLS-0377038.0001 | N-[1-(4-tert-butylphenyl)-4,5,6...)
Affinity DataIC50:  5.20E+3nM
In DepthDetails PCBioAssay
TargetTumor necrosis factor(Homo sapiens (Human))
Burnham Center For Chemical Genomics
Curated by PubChem BioAssay
LigandPNGBDBM62268(MLS-0377038.0001 | N-[1-(4-tert-butylphenyl)-4,5,6...)
Affinity DataIC50:  1.44E+3nM. Assay description: Data Source: Sanford-Burnham Center for Chemical Genomics (SBCCG) Source Affiliation: Sanford-Burnham Medical Research Institute (SBMRI, San Diego, C...
In DepthDetails PCBioAssay