BDBM62310 MLS-0425625.0001::N-[1-(2-fluorophenyl)-4,5,6,7-tetrahydroindazol-4-yl]-2,5-dimethyl-3-pyrazolecarboxamide::N-[1-(2-fluorophenyl)-4,5,6,7-tetrahydroindazol-4-yl]-2,5-dimethyl-pyrazole-3-carboxamide::N-[1-(2-fluorophenyl)-4,5,6,7-tetrahydroindazol-4-yl]-2,5-dimethylpyrazole-3-carboxamide::cid_44251464
SMILES Cc1cc(C(=O)NC2CCCc3c2cnn3-c2ccccc2F)n(C)n1
InChI Key InChIKey=HPSVJRBUHQCFRE-UHFFFAOYSA-N
Data  3 IC50
  Tab Delimited (TSV)   2D SDfile   Computed 3D by Vconf -m prep SDfile
Find this compound or compounds like it in BindingDB:
Activity Spreadsheet -- Enzyme Inhibition Constant Data from BindingDB
Found 3 hits for monomerid = 62310
TargetNucleotide-binding oligomerization domain-containing protein 1(Homo sapiens (Human))
Burnham Center For Chemical Genomics
Curated by PubChem BioAssay
LigandPNGBDBM62310(MLS-0425625.0001 | N-[1-(2-fluorophenyl)-4,5,6,7-t...)
Affinity DataIC50:  146nM. Assay description: Data Source: Sanford-Burnham Center for Chemical Genomics (SBCCG) Source Affiliation: Sanford-Burnham Medical Research Institute (SBMRI, San Diego, C...
In DepthDetails PCBioAssay
TargetTumor necrosis factor(Homo sapiens (Human))
Burnham Center For Chemical Genomics
Curated by PubChem BioAssay
LigandPNGBDBM62310(MLS-0425625.0001 | N-[1-(2-fluorophenyl)-4,5,6,7-t...)
Affinity DataIC50: >2.00E+4nM. Assay description: Data Source: Sanford-Burnham Center for Chemical Genomics (SBCCG) Source Affiliation: Sanford-Burnham Medical Research Institute (SBMRI, San Diego, C...
In DepthDetails PCBioAssay
TargetNucleotide-binding oligomerization domain-containing protein 2(Homo sapiens (Human))
Burnham Center For Chemical Genomics
Curated by PubChem BioAssay
LigandPNGBDBM62310(MLS-0425625.0001 | N-[1-(2-fluorophenyl)-4,5,6,7-t...)
Affinity DataIC50:  2.00E+4nM. Assay description: Data Source: Sanford-Burnham Center for Chemical Genomics (SBCCG) Source Affiliation: Sanford-Burnham Medical Research Institute (SBMRI, San Diego, C...
In DepthDetails PCBioAssay