BDBM62313 1-(2-amino-1-benzimidazolyl)-2-phenylethanone::1-(2-aminobenzimidazol-1-yl)-2-phenyl-ethanone::1-(2-aminobenzimidazol-1-yl)-2-phenylethanone::1-(2-azanylbenzimidazol-1-yl)-2-phenyl-ethanone::MLS-0425645.0001::cid_1088429
SMILES Nc1nc2ccccc2n1C(=O)Cc1ccccc1
InChI Key InChIKey=VWWRVMYNXWIBJG-UHFFFAOYSA-N
Data  5 IC50
  Tab Delimited (TSV)   2D SDfile   Computed 3D by Vconf -m prep SDfile
Find this compound or compounds like it in BindingDB:
Activity Spreadsheet -- Enzyme Inhibition Constant Data from BindingDB
Found 5 hits for monomerid = 62313
TargetNucleotide-binding oligomerization domain-containing protein 1(Homo sapiens (Human))
Burnham Center For Chemical Genomics
Curated by PubChem BioAssay
LigandPNGBDBM62313(1-(2-amino-1-benzimidazolyl)-2-phenylethanone | 1-...)
Affinity DataIC50:  2.00E+4nM. Assay description: Data Source: Sanford-Burnham Center for Chemical Genomics (SBCCG) Source Affiliation: Sanford-Burnham Medical Research Institute (SBMRI, San Diego, C...
Ligand InfoPC cidPC sid
In DepthDetails PCBioAssay
TargetNucleotide-binding oligomerization domain-containing protein 2(Homo sapiens (Human))
Burnham Center For Chemical Genomics
Curated by PubChem BioAssay
LigandPNGBDBM62313(1-(2-amino-1-benzimidazolyl)-2-phenylethanone | 1-...)
Affinity DataIC50:  2.00E+4nM. Assay description: Data Source: Sanford-Burnham Center for Chemical Genomics (SBCCG) Source Affiliation: Sanford-Burnham Medical Research Institute (SBMRI, San Diego, C...
Ligand InfoPC cidPC sid
In DepthDetails PCBioAssay
TargetNucleotide-binding oligomerization domain-containing protein 2(Homo sapiens (Human))
Burnham Center For Chemical Genomics
Curated by PubChem BioAssay
LigandPNGBDBM62313(1-(2-amino-1-benzimidazolyl)-2-phenylethanone | 1-...)
Affinity DataIC50: >2.00E+4nM. Assay description: Inhibition of NOD-2 mediated NFkappaB activation in HEK293T cells assessed as inhibition of MDP-induced luciferase activity after 14 hrs by reporter ...
Ligand InfoPC cidPC sid
In DepthDetails ArticlePubMed
TargetNucleotide-binding oligomerization domain-containing protein 1(Homo sapiens (Human))
Burnham Center For Chemical Genomics
Curated by PubChem BioAssay
LigandPNGBDBM62313(1-(2-amino-1-benzimidazolyl)-2-phenylethanone | 1-...)
Affinity DataIC50: >2.00E+4nM. Assay description: Inhibition of NOD-1 mediated NFkappaB activation in HEK293T cells assessed as inhibition of gamma-tri-DAP-induced luciferase activity after 14 hrs by...
Ligand InfoPC cidPC sid
In DepthDetails ArticlePubMed
TargetTumor necrosis factor(Homo sapiens (Human))
Burnham Center For Chemical Genomics
Curated by PubChem BioAssay
LigandPNGBDBM62313(1-(2-amino-1-benzimidazolyl)-2-phenylethanone | 1-...)
Affinity DataIC50: >2.00E+4nM. Assay description: Data Source: Sanford-Burnham Center for Chemical Genomics (SBCCG) Source Affiliation: Sanford-Burnham Medical Research Institute (SBMRI, San Diego, C...
Ligand InfoPC cidPC sid
In DepthDetails PCBioAssay