BDBM62351 2-[(2-bromobenzoyl)amino]-6-ethyl-4,5,6,7-tetrahydrobenzothiophene-3-carboxylic acid methyl ester::2-[[(2-bromophenyl)-oxomethyl]amino]-6-ethyl-4,5,6,7-tetrahydro-1-benzothiophene-3-carboxylic acid methyl ester::MLS-0435420.0001::cid_2862460::methyl 2-[(2-bromobenzoyl)amino]-6-ethyl-4,5,6,7-tetrahydro-1-benzothiophene-3-carboxylate::methyl 2-[(2-bromophenyl)carbonylamino]-6-ethyl-4,5,6,7-tetrahydro-1-benzothiophene-3-carboxylate
SMILES CCC1CCc2c(C1)sc(NC(=O)c1ccccc1Br)c2C(=O)OC
InChI Key InChIKey=KBKWXKVOIMUJPS-UHFFFAOYSA-N
Data  3 IC50
  Tab Delimited (TSV)   2D SDfile   Computed 3D by Vconf -m prep SDfile
Find this compound or compounds like it in BindingDB:
Activity Spreadsheet -- Enzyme Inhibition Constant Data from BindingDB
Found 3 hits for monomerid = 62351
TargetNucleotide-binding oligomerization domain-containing protein 1(Homo sapiens (Human))
Burnham Center For Chemical Genomics
Curated by PubChem BioAssay
LigandPNGBDBM62351(2-[(2-bromobenzoyl)amino]-6-ethyl-4,5,6,7-tetrahyd...)
Affinity DataIC50:  2.00E+4nM. Assay description: Data Source: Sanford-Burnham Center for Chemical Genomics (SBCCG) Source Affiliation: Sanford-Burnham Medical Research Institute (SBMRI, San Diego, C...
In DepthDetails PCBioAssay
TargetTumor necrosis factor(Homo sapiens (Human))
Burnham Center For Chemical Genomics
Curated by PubChem BioAssay
LigandPNGBDBM62351(2-[(2-bromobenzoyl)amino]-6-ethyl-4,5,6,7-tetrahyd...)
Affinity DataIC50: >2.00E+4nM. Assay description: Data Source: Sanford-Burnham Center for Chemical Genomics (SBCCG) Source Affiliation: Sanford-Burnham Medical Research Institute (SBMRI, San Diego, C...
In DepthDetails PCBioAssay
TargetNucleotide-binding oligomerization domain-containing protein 2(Homo sapiens (Human))
Burnham Center For Chemical Genomics
Curated by PubChem BioAssay
LigandPNGBDBM62351(2-[(2-bromobenzoyl)amino]-6-ethyl-4,5,6,7-tetrahyd...)
Affinity DataIC50:  2.00E+4nM. Assay description: Data Source: Sanford-Burnham Center for Chemical Genomics (SBCCG) Source Affiliation: Sanford-Burnham Medical Research Institute (SBMRI, San Diego, C...
In DepthDetails PCBioAssay