BDBM62499 4-Amino-isothiazole-3,5-dicarboxylic acid 3-amide 5-[{(4-dimethylamino-phenyl)-[(tetrahydro-furan-2-ylmethyl)-carbamoyl]-methyl}-(2,3-dimethyl-phenyl)-amide]::4-amino-5-N-[1-[4-(dimethylamino)phenyl]-2-oxo-2-(oxolan-2-ylmethylamino)ethyl]-5-N-(2,3-dimethylphenyl)-1,2-thiazole-3,5-dicarboxamide::4-amino-N'-[1-[4-(dimethylamino)phenyl]-2-keto-2-(tetrahydrofurfurylamino)ethyl]-N'-(2,3-dimethylphenyl)isothiazole-3,5-dicarboxamide::4-amino-N5-[1-[4-(dimethylamino)phenyl]-2-oxo-2-(2-oxolanylmethylamino)ethyl]-N5-(2,3-dimethylphenyl)isothiazole-3,5-dicarboxamide::4-azanyl-N5-[1-[4-(dimethylamino)phenyl]-2-oxidanylidene-2-(oxolan-2-ylmethylamino)ethyl]-N5-(2,3-dimethylphenyl)-1,2-thiazole-3,5-dicarboxamide::MLS001217599::SMR000600070::cid_3185717
SMILES CN(C)c1ccc(cc1)C(N(C(=O)c1snc(C(N)=O)c1N)c1cccc(C)c1C)C(=O)NCC1CCCO1
InChI Key InChIKey=XAYHHUOMJRVIFS-UHFFFAOYSA-N
Data  2 IC50
  Tab Delimited (TSV)   2D SDfile   Computed 3D by Vconf -m prep SDfile
Find this compound or compounds like it in BindingDB:
Activity Spreadsheet -- Enzyme Inhibition Constant Data from BindingDB
Found 2 hits for monomerid = 62499
TargetEpstein-Barr nuclear antigen 1(Human herpesvirus 4)
The Scripps Research Institute Molecular Screening Center
Curated by PubChem BioAssay
LigandPNGBDBM62499(4-Amino-isothiazole-3,5-dicarboxylic acid 3-amide ...)
Affinity DataIC50:  2.73E+3nM. Assay description: Source (MLPCN Center Name): The Scripps Research Institute Molecular Screening Center (SRIMSC) Center Affiliation: The Scripps Research Institute (TS...
In DepthDetails PCBioAssay
TargetTrans-activator protein BZLF1(Human herpesvirus 4)
The Scripps Research Institute Molecular Screening Center
Curated by PubChem BioAssay
LigandPNGBDBM62499(4-Amino-isothiazole-3,5-dicarboxylic acid 3-amide ...)
Affinity DataIC50:  1.11E+5nM. Assay description: Source (MLPCN Center Name): The Scripps Research Institute Molecular Screening Center (SRIMSC) Center Affiliation: The Scripps Research Institute (TS...
In DepthDetails PCBioAssay