BDBM63359 4-(3,4-dimethylphenyl)-10-(1-methylethylidene)-4-azatricyclo[5.2.1.0~2,6~]decane-3,5-dione::MLS000683723::SMR000272324::cid_2932688
SMILES [H]C12[#6]-[#6]C([H])([#6]-3-[#6]1-[#6](=O)-[#7](-[#6]-3=O)-c1ccc(-[#6])c(-[#6])c1)\[#6]2=[#6](/[#6])-[#6]
InChI Key InChIKey=XVMUWRSZIXHJSM-UHFFFAOYSA-N
Data  1 EC50
  Tab Delimited (TSV)   2D SDfile   Computed 3D by Vconf -m prep SDfile
Find this compound or compounds like it in BindingDB:
Activity Spreadsheet -- Enzyme Inhibition Constant Data from BindingDB
Found 1 hit for monomerid = 63359
TargetHeat shock factor protein 1(Mus musculus)
Broad Institute
Curated by PubChem BioAssay
LigandPNGBDBM63359(4-(3,4-dimethylphenyl)-10-(1-methylethylidene)-4-a...)
Affinity DataEC50: >1.95E+5nM. Assay description: Keywords: Heat Shock Factor-1 (HSF-1), Stress Response, MG132, NIH3T3, Luminescence Assay Overview: Modified NIH3T3, transformed to express firefly...
In DepthDetails PCBioAssay