BDBM63808 2-N-[3-(dimethylamino)propyl]-4-N-(2-methoxyphenyl)-5-nitropyrimidine-2,4,6-triamine::3-[[4-amino-5-nitro-6-(o-anisidino)pyrimidin-2-yl]amino]propyl-dimethyl-amine::MLS000333393::N-(3-Dimethylamino-propyl)-N'-(2-methoxy-phenyl)-5-nitro-pyrimidine-2,4,6-triamine::N2-[3-(dimethylamino)propyl]-N4-(2-methoxyphenyl)-5-nitro-pyrimidine-2,4,6-triamine::N2-[3-(dimethylamino)propyl]-N4-(2-methoxyphenyl)-5-nitropyrimidine-2,4,6-triamine::SMR000436733::cid_4396771
SMILES COc1ccccc1Nc1nc(NCCCN(C)C)nc(N)c1[N+]([O-])=O
InChI Key InChIKey=QEEHDVRSGWQODE-UHFFFAOYSA-N
Data  2 EC50
  Tab Delimited (TSV)   2D SDfile   Computed 3D by Vconf -m prep SDfile
Find this compound or compounds like it in BindingDB:
Activity Spreadsheet -- Enzyme Inhibition Constant Data from BindingDB
Found 2 hits for monomerid = 63808
TargetGlycogen synthase kinase-3 beta(Homo sapiens (Human))
Broad Institute
Curated by PubChem BioAssay
LigandPNGBDBM63808(2-N-[3-(dimethylamino)propyl]-4-N-(2-methoxyphenyl...)
Affinity DataEC50:  2.13E+3nM. Assay description: Keywords: GSK3beta, dose response, kinase, inhibition, HTS Assay Overview: The glycogen synthase kinase-3 beta (GSK-3b) is a known master regulator f...
In DepthDetails PCBioAssay
TargetHeat shock factor protein 1(Mus musculus)
Broad Institute
Curated by PubChem BioAssay
LigandPNGBDBM63808(2-N-[3-(dimethylamino)propyl]-4-N-(2-methoxyphenyl...)
Affinity DataEC50: >1.95E+5nM. Assay description: Keywords: Heat Shock Factor-1 (HSF-1), Stress Response, MG132, NIH3T3, Luminescence Assay Overview: Modified NIH3T3, transformed to express firefly...
In DepthDetails PCBioAssay