BDBM64296 MLS001126583::N-[3-(3-chlorophenyl)phenyl]-1-[(1-ethyl-3-methyl-4-pyrazolyl)methyl]-4-piperidinecarboxamide::N-[3-(3-chlorophenyl)phenyl]-1-[(1-ethyl-3-methyl-pyrazol-4-yl)methyl]isonipecotamide::N-[3-(3-chlorophenyl)phenyl]-1-[(1-ethyl-3-methyl-pyrazol-4-yl)methyl]piperidine-4-carboxamide::N-[3-(3-chlorophenyl)phenyl]-1-[(1-ethyl-3-methylpyrazol-4-yl)methyl]piperidine-4-carboxamide::SMR000671754::cid_24792012
SMILES CCn1cc(CN2CCC(CC2)C(=O)Nc2cccc(c2)-c2cccc(Cl)c2)c(C)n1
InChI Key InChIKey=FNZIQFHZOIRQGG-UHFFFAOYSA-N
Data  4 IC50  2 EC50
  Tab Delimited (TSV)   2D SDfile   Computed 3D by Vconf -m prep SDfile
Find this compound or compounds like it in BindingDB:
Activity Spreadsheet -- Enzyme Inhibition Constant Data from BindingDB
Found 6 hits for monomerid = 64296
TargetHeat shock factor protein 1(Mus musculus)
Broad Institute
Curated by PubChem BioAssay
LigandPNGBDBM64296(MLS001126583 | N-[3-(3-chlorophenyl)phenyl]-1-[(1-...)
Affinity DataEC50: >1.95E+5nM. Assay description: Keywords: Heat Shock Factor-1 (HSF-1), Stress Response, MG132, NIH3T3, Luminescence Assay Overview: Modified NIH3T3, transformed to express firefly...
In DepthDetails PCBioAssay
TargetIntestinal-type alkaline phosphatase(Homo sapiens (Human))
Burnham Center For Chemical Genomics
Curated by PubChem BioAssay
LigandPNGBDBM64296(MLS001126583 | N-[3-(3-chlorophenyl)phenyl]-1-[(1-...)
Affinity DataIC50: >1.00E+5nM. Assay description: Data Source: Sanford-Burnham Center for Chemical Genomics (SBCCG) Source Affiliation: Sanford-Burnham Medical Research Institute(SBMRI, San Diego, CA...
In DepthDetails PCBioAssay
TargetXylosyl- and glucuronyltransferase LARGE1(Homo sapiens (Human))
Burnham Center For Chemical Genomics
Curated by PubChem BioAssay
LigandPNGBDBM64296(MLS001126583 | N-[3-(3-chlorophenyl)phenyl]-1-[(1-...)
Affinity DataEC50:  6.99E+3nM
In DepthDetails PCBioAssay
TargetAlkaline phosphatase, tissue-nonspecific isozyme(Homo sapiens (Human))
Burnham Center For Chemical Genomics
Curated by PubChem BioAssay
LigandPNGBDBM64296(MLS001126583 | N-[3-(3-chlorophenyl)phenyl]-1-[(1-...)
Affinity DataIC50: >1.00E+5nM. Assay description: Data Source: Sanford-Burnham Center for Chemical Genomics (SBCCG) Source Affiliation: Sanford-Burnham Medical Research Institute (SBMRI, San Diego, C...
In DepthDetails PCBioAssay
TargetIntestinal-type alkaline phosphatase 1(Rattus norvegicus (Rat))
Burnham Center For Chemical Genomics
Curated by PubChem BioAssay
LigandPNGBDBM64296(MLS001126583 | N-[3-(3-chlorophenyl)phenyl]-1-[(1-...)
Affinity DataIC50:  1.28E+4nM. Assay description: Data Source: Sanford-Burnham Center for Chemical Genomics (SBCCG) Source Affiliation: Sanford-Burnham Medical Research Institute (SBMRI, San Diego, C...
In DepthDetails PCBioAssay
TargetAlkaline phosphatase, germ cell type(Homo sapiens (Human))
Burnham Center For Chemical Genomics
Curated by PubChem BioAssay
LigandPNGBDBM64296(MLS001126583 | N-[3-(3-chlorophenyl)phenyl]-1-[(1-...)
Affinity DataIC50: >1.00E+5nM. Assay description: Data Source: Sanford-Burnham Center for Chemical Genomics (SBCCG) Source Affiliation: Sanford-Burnham Medical Research Institute (SBMRI, San Diego, C...
In DepthDetails PCBioAssay