BDBM64645 1-(2-chlorophenyl)-4-keto-2-thioxo-1,3-diazaspiro[4.5]decane-3-carboxylic acid ethyl ester::1-(2-chlorophenyl)-4-oxo-2-sulfanylidene-1,3-diazaspiro[4.5]decane-3-carboxylic acid ethyl ester::MLS000699165::SMR000225922::cid_4032236::ethyl 1-(2-chlorophenyl)-4-oxidanylidene-2-sulfanylidene-1,3-diazaspiro[4.5]decane-3-carboxylate::ethyl 1-(2-chlorophenyl)-4-oxo-2-sulfanylidene-1,3-diazaspiro[4.5]decane-3-carboxylate::ethyl 1-(2-chlorophenyl)-4-oxo-2-thioxo-1,3-diazaspiro[4.5]decane-3-carboxylate
SMILES CCOC(=O)N1C(=S)N(c2ccccc2Cl)C2(CCCCC2)C1=O
InChI Key InChIKey=LTDMFCIPBPBFGY-UHFFFAOYSA-N
Data  2 IC50
  Tab Delimited (TSV)   2D SDfile   Computed 3D by Vconf -m prep SDfile
Find this compound or compounds like it in BindingDB:
Activity Spreadsheet -- Enzyme Inhibition Constant Data from BindingDB
Found 2 hits for monomerid = 64645
TargetNACHT, LRR and PYD domains-containing protein 3(Homo sapiens (Human))
Burnham Center For Chemical Genomics
Curated by PubChem BioAssay
LigandPNGBDBM64645(1-(2-chlorophenyl)-4-keto-2-thioxo-1,3-diazaspiro[...)
Affinity DataIC50:  1.06E+4nM. Assay description: Data Source: Sanford-Burnham Center for Chemical Genomics (SBCCG) Source Affiliation: Sanford-Burnham Medical Research Institute (SBMRI, San Diego, C...
In DepthDetails PCBioAssay
TargetNACHT, LRR and PYD domains-containing protein 3(Homo sapiens (Human))
Burnham Center For Chemical Genomics
Curated by PubChem BioAssay
LigandPNGBDBM64645(1-(2-chlorophenyl)-4-keto-2-thioxo-1,3-diazaspiro[...)
Affinity DataIC50:  5.92E+3nM. Assay description: Data Source: Sanford-Burnham Center for Chemical Genomics (SBCCG) Source Affiliation: Sanford-Burnham Medical Research Institute (SBMRI, San Diego, C...
In DepthDetails PCBioAssay