BDBM64780 4-Methyl-benzoic acid N'-(2,6-di-pyrrolidin-1-yl-pyrimidin-4-yl)-hydrazide::MLS000551080::N'-(2,6-dipyrrolidin-1-ylpyrimidin-4-yl)-4-methyl-benzohydrazide::N'-(2,6-dipyrrolidin-1-ylpyrimidin-4-yl)-4-methylbenzohydrazide::N'-(2,6-dipyrrolidinopyrimidin-4-yl)-4-methyl-benzohydrazide::N'-[2,6-bis(1-pyrrolidinyl)-4-pyrimidinyl]-4-methylbenzohydrazide::SMR000176238::cid_1109408
SMILES Cc1ccc(cc1)C(=O)NNc1cc(nc(n1)N1CCCC1)N1CCCC1
InChI Key InChIKey=AVHYTXJNAXLTFO-UHFFFAOYSA-N
Data  9 IC50
  Tab Delimited (TSV)   2D SDfile   Computed 3D by Vconf -m prep SDfile
Find this compound or compounds like it in BindingDB:
Activity Spreadsheet -- Enzyme Inhibition Constant Data from BindingDB
Found 9 hits for monomerid = 64780
TargetSerine/threonine-protein phosphatase PP1-alpha catalytic subunit(Homo sapiens (Human))
The Scripps Research Institute Molecular Screening Center
Curated by PubChem BioAssay
LigandPNGBDBM64780(4-Methyl-benzoic acid N'-(2,6-di-pyrrolidin-1-...)
Affinity DataIC50:  6.40E+4nM. Assay description: Source (MLPCN Center Name): The Scripps Research Institute Molecular Screening Center (SRIMSC) Center Affiliation: The Scripps Research Institute (TS...
In DepthDetails PCBioAssay
TargetSerine/threonine-protein phosphatase(Homo sapiens (Human))
The Scripps Research Institute Molecular Screening Center
Curated by PubChem BioAssay
LigandPNGBDBM64780(4-Methyl-benzoic acid N'-(2,6-di-pyrrolidin-1-...)
Affinity DataIC50:  4.10E+3nM. Assay description: Source (MLPCN Center Name): The Scripps Research Institute Molecular Screening Center (SRIMSC) Center Affiliation: The Scripps Research Institute (TS...
In DepthDetails PCBioAssay
TargetSentrin-specific protease 8(Homo sapiens (Human))
Burnham Center For Chemical Genomics
Curated by PubChem BioAssay
LigandPNGBDBM64780(4-Methyl-benzoic acid N'-(2,6-di-pyrrolidin-1-...)
Affinity DataIC50:  4.60E+3nM. Assay description: Data Source: Sanford-Burnham Center for Chemical Genomics (SBCCG) Source Affiliation: Sanford-Burnham Medical Research Institute (SBMRI, San Diego, C...
In DepthDetails PCBioAssay
TargetSentrin-specific protease 8(Homo sapiens (Human))
Burnham Center For Chemical Genomics
Curated by PubChem BioAssay
LigandPNGBDBM64780(4-Methyl-benzoic acid N'-(2,6-di-pyrrolidin-1-...)
Affinity DataIC50: >5.00E+3nM. Assay description: Data Source: Sanford-Burnham Center for Chemical Genomics (SBCCG) Source Affiliation: Sanford-Burnham Medical Research Institute (SBMRI, San Diego, C...
In DepthDetails PCBioAssay
TargetCaspase-9(Homo sapiens (Human))
Burnham Center For Chemical Genomics
Curated by PubChem BioAssay
LigandPNGBDBM64780(4-Methyl-benzoic acid N'-(2,6-di-pyrrolidin-1-...)
Affinity DataIC50:  2.74E+3nM. Assay description: Data Source: Sanford-Burnham Center for Chemical Genomics (SBCCG) Source Affiliation: Sanford-Burnham Medical Research Institute (SBIMR, San Diego, C...
In DepthDetails PCBioAssay
TargetCaspase-3(Homo sapiens (Human))
Burnham Center For Chemical Genomics
Curated by PubChem BioAssay
LigandPNGBDBM64780(4-Methyl-benzoic acid N'-(2,6-di-pyrrolidin-1-...)
Affinity DataIC50: >1.00E+5nM. Assay description: Data Source: Sanford-Burnham Center for Chemical Genomics (SBCCG) Source Affiliation: Sanford-Burnham Medical Research Institute (SBMRI, San Diego, C...
In DepthDetails PCBioAssay
TargetApoptotic protease-activating factor 1(Homo sapiens (Human))
Burnham Center For Chemical Genomics
Curated by PubChem BioAssay
LigandPNGBDBM64780(4-Methyl-benzoic acid N'-(2,6-di-pyrrolidin-1-...)
Affinity DataIC50:  5.08E+3nM. Assay description: Data Source: Sanford-Burnham Center for Chemical Genomics (SBCCG) Source Affiliation: Sanford-Burnham Medical Research Institute (SBIMR, San Diego, C...
In DepthDetails PCBioAssay
TargetApoptotic protease-activating factor 1(Homo sapiens (Human))
Burnham Center For Chemical Genomics
Curated by PubChem BioAssay
LigandPNGBDBM64780(4-Methyl-benzoic acid N'-(2,6-di-pyrrolidin-1-...)
Affinity DataIC50: >1.00E+5nM. Assay description: Data Source: Sanford-Burnham Center for Chemical Genomics (SBCCG) Source Affiliation: Sanford-Burnham Medical Research Institute (SBIMR, San Diego, C...
In DepthDetails PCBioAssay
TargetSentrin-specific protease 6(Homo sapiens (Human))
Burnham Center For Chemical Genomics
Curated by PubChem BioAssay
LigandPNGBDBM64780(4-Methyl-benzoic acid N'-(2,6-di-pyrrolidin-1-...)
Affinity DataIC50:  838nM. Assay description: Data Source: Sanford-Burnham Center for Chemical Genomics (SBCCG) Source Affiliation: Sanford-Burnham Medical Research Institute (SBMRI, San Diego, C...
In DepthDetails PCBioAssay