BDBM64815 MLS-0435425.0001::N-(3,4-dimethylphenyl)-2-[(4-keto-3-p-anisyl-thieno[3,2-d]pyrimidin-2-yl)thio]acetamide::N-(3,4-dimethylphenyl)-2-[3-[(4-methoxyphenyl)methyl]-4-oxidanylidene-thieno[3,2-d]pyrimidin-2-yl]sulfanyl-ethanamide::N-(3,4-dimethylphenyl)-2-[3-[(4-methoxyphenyl)methyl]-4-oxothieno[3,2-d]pyrimidin-2-yl]sulfanylacetamide::N-(3,4-dimethylphenyl)-2-[[3-[(4-methoxyphenyl)methyl]-4-oxo-2-thieno[3,2-d]pyrimidinyl]thio]acetamide::cid_4557708
SMILES COc1ccc(Cn2c(SCC(=O)Nc3ccc(C)c(C)c3)nc3ccsc3c2=O)cc1
InChI Key InChIKey=OSUQDPHHKLHQAB-UHFFFAOYSA-N
Data  2 IC50
  Tab Delimited (TSV)   2D SDfile   Computed 3D by Vconf -m prep SDfile
Find this compound or compounds like it in BindingDB:
Activity Spreadsheet -- Enzyme Inhibition Constant Data from BindingDB
Found 2 hits for monomerid = 64815
TargetNucleotide-binding oligomerization domain-containing protein 1(Homo sapiens (Human))
Burnham Center For Chemical Genomics
Curated by PubChem BioAssay
LigandPNGBDBM64815(MLS-0435425.0001 | N-(3,4-dimethylphenyl)-2-[(4-ke...)
Affinity DataIC50: >3.20E+4nM. Assay description: Data Source: Sanford-Burnham Center for Chemical Genomics Source Affiliation: Sanford-Burnham Medical Research Institute Network: NIH Molecular Lib...
In DepthDetails PCBioAssay
TargetG-protein coupled receptor 55(Homo sapiens (Human))
Burnham Center For Chemical Genomics
Curated by PubChem BioAssay
LigandPNGBDBM64815(MLS-0435425.0001 | N-(3,4-dimethylphenyl)-2-[(4-ke...)
Affinity DataIC50: >3.20E+4nM. Assay description: Data Source: Sanford-Burnham Center for Chemical Genomics(SSBCCG) Source Affiliation: Sanford-Burnham Medical Research Institute(SBMRI, San Diego, C...
In DepthDetails PCBioAssay