BDBM65788 2-(2-furanyl)-N-[2-(2-methoxyphenyl)ethyl]-4-quinolinecarboxamide::2-(2-furyl)-N-[2-(2-methoxyphenyl)ethyl]cinchoninamide::2-(furan-2-yl)-N-[2-(2-methoxyphenyl)ethyl]quinoline-4-carboxamide::VU0409714-1::cid_26778076
SMILES COc1ccccc1CCNC(=O)c1cc(nc2ccccc12)-c1ccco1
InChI Key InChIKey=ULUNJTWIDWHGDO-UHFFFAOYSA-N
Data  2 IC50
  Tab Delimited (TSV)   2D SDfile   Computed 3D by Vconf -m prep SDfile
Find this compound or compounds like it in BindingDB:
Activity Spreadsheet -- Enzyme Inhibition Constant Data from BindingDB
Found 2 hits for monomerid = 65788
TargetAmyloid-beta A4 precursor protein-binding family A member 1(Rattus norvegicus)
Burnham Center For Chemical Genomics
Curated by PubChem BioAssay
LigandPNGBDBM65788(2-(2-furanyl)-N-[2-(2-methoxyphenyl)ethyl]-4-quino...)
Affinity DataIC50:  2.58E+4nM. Assay description: Data Source: Sanford-Burnham Center for Chemical Genomics (SBCCG) Source Affiliation: Sanford-Burnham Medical Research Institute (SBMRI, San Diego, C...
In DepthDetails PCBioAssay
TargetAmyloid-beta A4 precursor protein-binding family A member 1(Rattus norvegicus)
Burnham Center For Chemical Genomics
Curated by PubChem BioAssay
LigandPNGBDBM65788(2-(2-furanyl)-N-[2-(2-methoxyphenyl)ethyl]-4-quino...)
Affinity DataIC50: >5.68E+4nM. Assay description: Data Source: Sanford-Burnham Center for Chemical Genomics (SBCCG) Source Affiliation: Sanford-Burnham Medical Research Institute (SBMRI, San Diego, C...
In DepthDetails PCBioAssay