BDBM65798 VU0409724-1::[2-(2-furanyl)-4-quinolinyl]-(3-phenyl-1-pyrrolidinyl)methanone::[2-(2-furyl)-4-quinolyl]-(3-phenylpyrrolidino)methanone::[2-(furan-2-yl)quinolin-4-yl]-(3-phenylpyrrolidin-1-yl)methanone::cid_44602314
SMILES O=C(N1CCC(C1)c1ccccc1)c1cc(nc2ccccc12)-c1ccco1
InChI Key InChIKey=BHXLGTYMZIISRP-UHFFFAOYSA-N
Data  2 IC50
  Tab Delimited (TSV)   2D SDfile   Computed 3D by Vconf -m prep SDfile
Find this compound or compounds like it in BindingDB:
Activity Spreadsheet -- Enzyme Inhibition Constant Data from BindingDB
Found 2 hits for monomerid = 65798
TargetAmyloid-beta A4 precursor protein-binding family A member 1(Rattus norvegicus)
Burnham Center For Chemical Genomics
Curated by PubChem BioAssay
LigandPNGBDBM65798(VU0409724-1 | [2-(2-furanyl)-4-quinolinyl]-(3-phen...)
Affinity DataIC50:  1.36E+4nM. Assay description: Data Source: Sanford-Burnham Center for Chemical Genomics (SBCCG) Source Affiliation: Sanford-Burnham Medical Research Institute (SBMRI, San Diego, C...
In DepthDetails PCBioAssay
TargetAmyloid-beta A4 precursor protein-binding family A member 1(Rattus norvegicus)
Burnham Center For Chemical Genomics
Curated by PubChem BioAssay
LigandPNGBDBM65798(VU0409724-1 | [2-(2-furanyl)-4-quinolinyl]-(3-phen...)
Affinity DataIC50: >5.68E+4nM. Assay description: Data Source: Sanford-Burnham Center for Chemical Genomics (SBCCG) Source Affiliation: Sanford-Burnham Medical Research Institute (SBMRI, San Diego, C...
In DepthDetails PCBioAssay