BDBM65845 1-[4-(dimethylamino)phenyl]-3-(1-naphthalenyl)urea::1-[4-(dimethylamino)phenyl]-3-(1-naphthyl)urea::1-[4-(dimethylamino)phenyl]-3-naphthalen-1-yl-urea::1-[4-(dimethylamino)phenyl]-3-naphthalen-1-ylurea::SR-01000301119::SR-01000301119-3::cid_1259066
SMILES CN(C)c1ccc(NC(=O)Nc2cccc3ccccc23)cc1
InChI Key InChIKey=ASLHLERRRGCLRB-UHFFFAOYSA-N
Data  1 IC50
  Tab Delimited (TSV)   2D SDfile   Computed 3D by Vconf -m prep SDfile
Find this compound or compounds like it in BindingDB:
Activity Spreadsheet -- Enzyme Inhibition Constant Data from BindingDB
Found 1 hit for monomerid = 65845
TargetNADPH oxidase 1(Homo sapiens (Human))
The Scripps Research Institute Molecular Screening Center
Curated by PubChem BioAssay
LigandPNGBDBM65845(1-[4-(dimethylamino)phenyl]-3-(1-naphthalenyl)urea...)
Affinity DataIC50:  464nM. Assay description: Data Source (MLPCN Center Name): The Scripps Research Institute Molecular Screening Center (SRIMSC) Center Affiliation: The Scripps Research Institut...
In DepthDetails PCBioAssay