BDBM65850 (10-methylphenothiazin-3-yl)amine::10-methyl-3-phenothiazinamine::10-methylphenothiazin-3-amine::SR-01000783716::SR-01000783716-2::cid_717880
SMILES CN1c2ccccc2Sc2cc(N)ccc12
InChI Key InChIKey=HFXCUJLZEIBVQQ-UHFFFAOYSA-N
Data  1 IC50
  Tab Delimited (TSV)   2D SDfile   Computed 3D by Vconf -m prep SDfile
Find this compound or compounds like it in BindingDB:
Activity Spreadsheet -- Enzyme Inhibition Constant Data from BindingDB
Found 1 hit for monomerid = 65850
TargetNADPH oxidase 1(Homo sapiens (Human))
The Scripps Research Institute Molecular Screening Center
Curated by PubChem BioAssay
LigandPNGBDBM65850((10-methylphenothiazin-3-yl)amine | 10-methyl-3-ph...)
Affinity DataIC50:  44nM. Assay description: Data Source (MLPCN Center Name): The Scripps Research Institute Molecular Screening Center (SRIMSC) Center Affiliation: The Scripps Research Institut...
In DepthDetails PCBioAssay