BDBM65930 1-(1,3-benzodioxol-5-yl)-3-(3-pyridinyl)urea::1-(1,3-benzodioxol-5-yl)-3-(3-pyridyl)urea::1-(1,3-benzodioxol-5-yl)-3-pyridin-3-yl-urea::1-(1,3-benzodioxol-5-yl)-3-pyridin-3-ylurea::VU0155960-1::cid_970916
SMILES O=C(Nc1cccnc1)Nc1ccc2OCOc2c1
InChI Key InChIKey=CEKOTFPXGSWQLI-UHFFFAOYSA-N
Data  1 EC50
  Tab Delimited (TSV)   2D SDfile   Computed 3D by Vconf -m prep SDfile
Find this compound or compounds like it in BindingDB:
Activity Spreadsheet -- Enzyme Inhibition Constant Data from BindingDB
Found 1 hit for monomerid = 65930
TargetPotassium voltage-gated channel subfamily KQT member 2(Rattus norvegicus)
Johns Hopkins Ion Channel Center
Curated by PubChem BioAssay
LigandPNGBDBM65930(1-(1,3-benzodioxol-5-yl)-3-(3-pyridinyl)urea | 1-(...)
Affinity DataEC50:  1.52E+5nM. Assay description: Name: Dose response of Retigabine-insensitive compounds that potentiate KCNQ2 potassium channel BioAssay Type: Confirmatory, Concentration-Response R...
In DepthDetails PCBioAssay