BDBM65947 1-(6-chloranylpyridin-3-yl)-3-(3-fluorophenyl)urea::1-(6-chloro-3-pyridinyl)-3-(3-fluorophenyl)urea::1-(6-chloro-3-pyridyl)-3-(3-fluorophenyl)urea::1-(6-chloropyridin-3-yl)-3-(3-fluorophenyl)urea::VU0417938-1::cid_45489574
SMILES Fc1cccc(NC(=O)Nc2ccc(Cl)nc2)c1
InChI Key InChIKey=GWGLETBPIABFAA-UHFFFAOYSA-N
Data  1 EC50
  Tab Delimited (TSV)   2D SDfile   Computed 3D by Vconf -m prep SDfile
Find this compound or compounds like it in BindingDB:
Activity Spreadsheet -- Enzyme Inhibition Constant Data from BindingDB
Found 1 hit for monomerid = 65947
TargetPotassium voltage-gated channel subfamily KQT member 2(Rattus norvegicus)
Johns Hopkins Ion Channel Center
Curated by PubChem BioAssay
LigandPNGBDBM65947(1-(6-chloranylpyridin-3-yl)-3-(3-fluorophenyl)urea...)
Affinity DataEC50:  2.81E+3nM. Assay description: Name: Dose response of Retigabine-insensitive compounds that potentiate KCNQ2 potassium channel BioAssay Type: Confirmatory, Concentration-Response R...
Ligand InfoPC cidPC sid
In DepthDetails PCBioAssay