BDBM66020 MLS002153616::SK-IK::SMR001230884::cid_24983085
SMILES CC[C@H](C)Cc1cn(nn1)[C@@H](CCCCN)C(=O)NCCCCCCCCCCC(=O)N1CCN(CC1)c1nc(NCCOCCOCCOCC#C)nc(n1)N1CCN(CC1)C(=O)CCCCCCCCCCNC(=O)[C@H](CCCCN)n1cc(CCO)nn1
InChI Key InChIKey=AXEMQUFKQNYTDG-SKQSIOIRSA-N
Data  2 IC50  1 EC50
  Tab Delimited (TSV)   2D SDfile   Computed 3D by Vconf -m prep SDfile
Find this compound or compounds like it in BindingDB:
Activity Spreadsheet -- Enzyme Inhibition Constant Data from BindingDB
Found 3 hits for monomerid = 66020
Target60S ribosomal protein L19-A(Saccharomyces cerevisiae)
Nmmlsc
Curated by PubChem BioAssay
LigandPNGBDBM66020(MLS002153616 | SK-IK | SMR001230884 | cid_24983085)
Affinity DataEC50:  1.01E+4nM. Assay description: University of New Mexico Assay Overview: Assay Support: 1R03 MH086450-01 Project Title: Chemical Screen of TOR pathway GFP fusion proteins in S. ...
In DepthDetails PCBioAssay
TargetPhospholipase A2(Homo sapiens (Human))
Burnham Center For Chemical Genomics
Curated by PubChem BioAssay
LigandPNGBDBM66020(MLS002153616 | SK-IK | SMR001230884 | cid_24983085)
Affinity DataIC50:  1.01E+4nM. Assay description: Data Source: Sanford-Burnham Center for Chemical Genomics (SBCCG) Source Affiliation: Sanford-Burnham Medical Research Institute (SBMRI, San Diego, C...
In DepthDetails PCBioAssay
TargetCysteine protease ATG4B(Homo sapiens (Human))
Burnham Center For Chemical Genomics
Curated by PubChem BioAssay
LigandPNGBDBM66020(MLS002153616 | SK-IK | SMR001230884 | cid_24983085)
Affinity DataIC50:  7.12E+3nM. Assay description: Data Source: Sanford-Burnham Center for Chemical Genomics (SBCCG) Source Affiliation: Sanford-Burnham Medical Research Institute (SBMRI, San Diego, C...
In DepthDetails PCBioAssay