BDBM66105 1-(6,7,8,9-tetrahydro-5H-carbazol-2-yl)ethanone oxime::MLS000108291::N-[1-(6,7,8,9-tetrahydro-5H-carbazol-2-yl)ethylidene]hydroxylamine::SMR000104252::cid_873533
SMILES CC(N=O)c1ccc2c3CCCCc3[nH]c2c1
InChI Key InChIKey=GCIKVSLEBNEOCU-UHFFFAOYSA-N
Data  3 IC50
  Tab Delimited (TSV)   2D SDfile   Computed 3D by Vconf -m prep SDfile
Find this compound or compounds like it in BindingDB:
Activity Spreadsheet -- Enzyme Inhibition Constant Data from BindingDB
Found 3 hits for monomerid = 66105
TargetBeta-lactamase(Pseudomonas aeruginosa)
The Scripps Research Institute Molecular Screening Center
Curated by PubChem BioAssay
LigandPNGBDBM66105(1-(6,7,8,9-tetrahydro-5H-carbazol-2-yl)ethanone ox...)
Affinity DataIC50: >5.96E+4nM. Assay description: Source (MLPCN Center Name): The Scripps Research Institute Molecular Screening Center (SRIMSC) Center Affiliation: The Scripps Research Institute (TS...
In DepthDetails PCBioAssay
TargetBeta-lactamase(Pseudomonas aeruginosa)
The Scripps Research Institute Molecular Screening Center
Curated by PubChem BioAssay
LigandPNGBDBM66105(1-(6,7,8,9-tetrahydro-5H-carbazol-2-yl)ethanone ox...)
Affinity DataIC50: >5.96E+4nM. Assay description: Source (MLPCN Center Name): The Scripps Research Institute Molecular Screening Center (SRIMSC) Center Affiliation: The Scripps Research Institute (TS...
In DepthDetails PCBioAssay
TargetBeta-lactamase(Salmonella enterica subsp. enterica serovar Choler...)
The Scripps Research Institute Molecular Screening Center
Curated by PubChem BioAssay
LigandPNGBDBM66105(1-(6,7,8,9-tetrahydro-5H-carbazol-2-yl)ethanone ox...)
Affinity DataIC50: >5.96E+4nM. Assay description: Source (MLPCN Center Name): The Scripps Research Institute Molecular Screening Center (SRIMSC) Center Affiliation: The Scripps Research Institute (TS...
In DepthDetails PCBioAssay