BDBM66106 7-(diethylamino)-3-(5-phenyl-1,3,4-oxadiazol-2-yl)-1-benzopyran-2-one::7-(diethylamino)-3-(5-phenyl-1,3,4-oxadiazol-2-yl)chromen-2-one::7-(diethylamino)-3-(5-phenyl-1,3,4-oxadiazol-2-yl)coumarin::7-Diethylamino-3-(5-phenyl-[1,3,4]oxadiazol-2-yl)-chromen-2-one::MLS000527442::SMR000117916::cid_397073
SMILES CCN(CC)c1ccc2cc(-c3nnc(o3)-c3ccccc3)c(=O)oc2c1
InChI Key InChIKey=WRCXJNPCCIZIOQ-UHFFFAOYSA-N
Data  3 IC50  4 EC50
  Tab Delimited (TSV)   2D SDfile   Computed 3D by Vconf -m prep SDfile
Find this compound or compounds like it in BindingDB:
Activity Spreadsheet -- Enzyme Inhibition Constant Data from BindingDB
Found 7 hits for monomerid = 66106
TargetBeta-lactamase(Pseudomonas aeruginosa)
The Scripps Research Institute Molecular Screening Center
Curated by PubChem BioAssay
LigandPNGBDBM66106(7-(diethylamino)-3-(5-phenyl-1,3,4-oxadiazol-2-yl)...)
Affinity DataIC50: >5.96E+4nM. Assay description: Source (MLPCN Center Name): The Scripps Research Institute Molecular Screening Center (SRIMSC) Center Affiliation: The Scripps Research Institute (TS...
In DepthDetails PCBioAssay
TargetBeta-lactamase(Salmonella enterica subsp. enterica serovar Choler...)
The Scripps Research Institute Molecular Screening Center
Curated by PubChem BioAssay
LigandPNGBDBM66106(7-(diethylamino)-3-(5-phenyl-1,3,4-oxadiazol-2-yl)...)
Affinity DataIC50: >5.96E+4nM. Assay description: Source (MLPCN Center Name): The Scripps Research Institute Molecular Screening Center (SRIMSC) Center Affiliation: The Scripps Research Institute (TS...
In DepthDetails PCBioAssay
TargetBeta-lactamase(Pseudomonas aeruginosa)
The Scripps Research Institute Molecular Screening Center
Curated by PubChem BioAssay
LigandPNGBDBM66106(7-(diethylamino)-3-(5-phenyl-1,3,4-oxadiazol-2-yl)...)
Affinity DataIC50: >5.96E+4nM. Assay description: Source (MLPCN Center Name): The Scripps Research Institute Molecular Screening Center (SRIMSC) Center Affiliation: The Scripps Research Institute (TS...
In DepthDetails PCBioAssay
TargetEndoribonuclease toxin MazF(Escherichia coli str. K-12 substr. MG1655)
Burnham Center For Chemical Genomics
Curated by PubChem BioAssay
LigandPNGBDBM66106(7-(diethylamino)-3-(5-phenyl-1,3,4-oxadiazol-2-yl)...)
Affinity DataEC50: >9.90E+4nM. Assay description: Data Source: Sanford-Burnham Center for Chemical Genomics (SBCCG) Source Affiliation: Sanford-Burnham Medical Research Institute (SBMRI, San Diego, C...
In DepthDetails PCBioAssay
TargetVoltage-dependent T-type calcium channel subunit alpha-1H(Homo sapiens (Human))
Vanderbilt Screening Center For Gpcrs, Ion Channels And Transporters
Curated by PubChem BioAssay
LigandPNGBDBM66106(7-(diethylamino)-3-(5-phenyl-1,3,4-oxadiazol-2-yl)...)
Affinity DataEC50:  931nM. Assay description: Assay Provider: Xinmin Xie Assay Provider Affiliation: Bioscience Division, SRI International, Menlo Park, CA Grant Title: HTS Assay for Cav3 T-Type ...
In DepthDetails PCBioAssay
TargetEndoribonuclease toxin MazF(Escherichia coli str. K-12 substr. MG1655)
Burnham Center For Chemical Genomics
Curated by PubChem BioAssay
LigandPNGBDBM66106(7-(diethylamino)-3-(5-phenyl-1,3,4-oxadiazol-2-yl)...)
Affinity DataEC50: >9.90E+4nM. Assay description: Data Source: Sanford-Burnham Center for Chemical Genomics (SBCCG) Source Affiliation: Sanford-Burnham Medical Research Institute (SBMRI, San Diego, C...
In DepthDetails PCBioAssay
TargetVoltage-dependent T-type calcium channel subunit alpha-1H(Homo sapiens (Human))
Vanderbilt Screening Center For Gpcrs, Ion Channels And Transporters
Curated by PubChem BioAssay
LigandPNGBDBM66106(7-(diethylamino)-3-(5-phenyl-1,3,4-oxadiazol-2-yl)...)
Affinity DataEC50:  3.19E+3nM. Assay description: Assay Provider: Xinmin Xie Assay Provider Affiliation: Bioscience Division, SRI International, Menlo Park, CA Grant Title: HTS Assay for Cav3 T-Type ...
In DepthDetails PCBioAssay