BDBM66280 1-(3-methyl-1-phenyl-1H-pyrazol-5-yl)-2,5-pyrrolidinedione::1-(5-methyl-2-phenyl-3-pyrazolyl)pyrrolidine-2,5-dione::1-(5-methyl-2-phenyl-pyrazol-3-yl)pyrrolidine-2,5-dione::1-(5-methyl-2-phenyl-pyrazol-3-yl)pyrrolidine-2,5-quinone::1-(5-methyl-2-phenylpyrazol-3-yl)pyrrolidine-2,5-dione::MLS000062702::SMR000071239::cid_686468
SMILES Cc1cc(-n2c(O)ccc2O)n(n1)-c1ccccc1
InChI Key InChIKey=SJJVJKGMTZBDKA-UHFFFAOYSA-N
Data  1 EC50
  Tab Delimited (TSV)   2D SDfile   Computed 3D by Vconf -m prep SDfile
Find this compound or compounds like it in BindingDB:
Activity Spreadsheet -- Enzyme Inhibition Constant Data from BindingDB
Found 1 hit for monomerid = 66280
TargetBcl-2-like protein 11(Homo sapiens (Human))
Broad Institute
Curated by PubChem BioAssay
LigandPNGBDBM66280(1-(3-methyl-1-phenyl-1H-pyrazol-5-yl)-2,5-pyrrolid...)
Affinity DataEC50: >3.50E+5nM. Assay description: Keywords: apoptosis, BH3 domain, Bcl2-A1, BIM, caspase, cancer Primary Collaborator: Todd Golub, Broad Institute, golub@broadinstitute.org Assay Over...
Ligand InfoPC cidPC sid
In DepthDetails PCBioAssay