BDBM66316 2-(4-Phenyl-6-trifluoromethyl-pyrimidin-2-ylsulfanyl)-1-piperidin-1-yl-propan-1-one::2-[4-phenyl-6-(trifluoromethyl)pyrimidin-2-yl]sulfanyl-1-piperidin-1-yl-propan-1-one::2-[4-phenyl-6-(trifluoromethyl)pyrimidin-2-yl]sulfanyl-1-piperidin-1-ylpropan-1-one::2-[[4-phenyl-6-(trifluoromethyl)-2-pyrimidinyl]thio]-1-(1-piperidinyl)-1-propanone::2-[[4-phenyl-6-(trifluoromethyl)pyrimidin-2-yl]thio]-1-piperidino-propan-1-one::MLS000525345::SMR000122219::cid_3145649
SMILES CC(Sc1nc(cc(n1)C(F)(F)F)-c1ccccc1)C(=O)N1CCCCC1
InChI Key InChIKey=JJWFFRWHTYYLAQ-UHFFFAOYSA-N
Data  3 EC50
  Tab Delimited (TSV)   2D SDfile   Computed 3D by Vconf -m prep SDfile
Find this compound or compounds like it in BindingDB:
Activity Spreadsheet -- Enzyme Inhibition Constant Data from BindingDB
Found 3 hits for monomerid = 66316
TargetBcl-2-like protein 11(Homo sapiens (Human))
Broad Institute
Curated by PubChem BioAssay
LigandPNGBDBM66316(2-(4-Phenyl-6-trifluoromethyl-pyrimidin-2-ylsulfan...)
Affinity DataEC50: >3.50E+5nM. Assay description: Keywords: apoptosis, BH3 domain, Bcl2-A1, BIM, caspase, cancer Primary Collaborator: Todd Golub, Broad Institute, golub@broadinstitute.org Assay Over...
In DepthDetails PCBioAssay
TargetBeta-2 adrenergic receptor(Homo sapiens (Human))
Nmmlsc
Curated by PubChem BioAssay
LigandPNGBDBM66316(2-(4-Phenyl-6-trifluoromethyl-pyrimidin-2-ylsulfan...)
Affinity DataEC50:  14.3nM. Assay description: University of New Mexico Assay Overview: Assay Support: R03 MH093192-01 Project Title: HTS for Non-Canonical Ligands for Beta 2 Adrenergic Receptor...
In DepthDetails PCBioAssay
TargetBeta-2 adrenergic receptor(Homo sapiens (Human))
Nmmlsc
Curated by PubChem BioAssay
LigandPNGBDBM66316(2-(4-Phenyl-6-trifluoromethyl-pyrimidin-2-ylsulfan...)
Affinity DataEC50:  214nM. Assay description: University of New Mexico Assay Overview: Assay Support: R03 MH093192-01 Project Title: HTS for Non-Canonical Ligands for Beta 2 Adrenergic Receptor...
In DepthDetails PCBioAssay