BDBM67097 3-[4-[4-(4-fluorophenyl)piperazin-1-yl]carbonylphenyl]-2-sulfanylidene-1H-quinazolin-4-one::3-[4-[4-(4-fluorophenyl)piperazine-1-carbonyl]phenyl]-2-sulfanylidene-1H-quinazolin-4-one::3-[4-[4-(4-fluorophenyl)piperazine-1-carbonyl]phenyl]-2-thioxo-1H-quinazolin-4-one::3-[4-[[4-(4-fluorophenyl)-1-piperazinyl]-oxomethyl]phenyl]-2-sulfanylidene-1H-quinazolin-4-one::SR-01000563049-2::cid_4076045
SMILES Fc1ccc(cc1)N1CCN(CC1)C(=O)c1ccc(cc1)-n1c(=S)[nH]c2ccccc2c1=O
InChI Key InChIKey=HIMZVHQHNADRIT-UHFFFAOYSA-N
Data  2 IC50
  Tab Delimited (TSV)   2D SDfile   Computed 3D by Vconf -m prep SDfile
Find this compound or compounds like it in BindingDB:
Activity Spreadsheet -- Enzyme Inhibition Constant Data from BindingDB
Found 2 hits for monomerid = 67097
TargetSignal transducer and activator of transcription 1-alpha/beta(Homo sapiens (Human))
The Scripps Research Institute Molecular Screening Center
Curated by PubChem BioAssay
LigandPNGBDBM67097(3-[4-[4-(4-fluorophenyl)piperazin-1-yl]carbonylphe...)
Affinity DataIC50: >5.57E+4nM. Assay description: Source (MLPCN Center Name): The Scripps Research Institute Molecular Screening Center Center Affiliation: The Scripps Research Institute (TSRI) Assay...
In DepthDetails PCBioAssay
TargetSignal transducer and activator of transcription 3 [702-738,740-752](Homo sapiens (Human))
The Scripps Research Institute Molecular Screening Center
Curated by PubChem BioAssay
LigandPNGBDBM67097(3-[4-[4-(4-fluorophenyl)piperazin-1-yl]carbonylphe...)
Affinity DataIC50: >5.57E+4nM. Assay description: Source (MLPCN Center Name): The Scripps Research Institute Molecular Screening Center Center Affiliation: The Scripps Research Institute (TSRI) Assay...
In DepthDetails PCBioAssay