BDBM67103 2-[(dimethylamino)methyl]-3-[[4-(3-nitrophenyl)-1,3-thiazol-2-yl]methyl]quinazolin-4-one::2-[(dimethylamino)methyl]-3-[[4-(3-nitrophenyl)-2-thiazolyl]methyl]-4-quinazolinone::2-[(dimethylamino)methyl]-3-[[4-(3-nitrophenyl)thiazol-2-yl]methyl]quinazolin-4-one::SR-01000741204-2::cid_2086912
SMILES CN(C)Cc1nc2ccccc2c(=O)n1Cc1nc(cs1)-c1cccc(c1)[N+]([O-])=O
InChI Key InChIKey=BSFKSPMFIITGFW-UHFFFAOYSA-N
Data  2 IC50
  Tab Delimited (TSV)   2D SDfile   Computed 3D by Vconf -m prep SDfile
Find this compound or compounds like it in BindingDB:
Activity Spreadsheet -- Enzyme Inhibition Constant Data from BindingDB
Found 2 hits for monomerid = 67103
TargetSignal transducer and activator of transcription 1-alpha/beta(Homo sapiens (Human))
The Scripps Research Institute Molecular Screening Center
Curated by PubChem BioAssay
LigandPNGBDBM67103(2-[(dimethylamino)methyl]-3-[[4-(3-nitrophenyl)-1,...)
Affinity DataIC50: >1.86E+4nM. Assay description: Source (MLPCN Center Name): The Scripps Research Institute Molecular Screening Center Center Affiliation: The Scripps Research Institute (TSRI) Assay...
In DepthDetails PCBioAssay
TargetSignal transducer and activator of transcription 3 [702-738,740-752](Homo sapiens (Human))
The Scripps Research Institute Molecular Screening Center
Curated by PubChem BioAssay
LigandPNGBDBM67103(2-[(dimethylamino)methyl]-3-[[4-(3-nitrophenyl)-1,...)
Affinity DataIC50: >5.57E+4nM. Assay description: Source (MLPCN Center Name): The Scripps Research Institute Molecular Screening Center Center Affiliation: The Scripps Research Institute (TSRI) Assay...
In DepthDetails PCBioAssay