BDBM67109 2-(4-besylpiperazino)-N-[4-chloro-3-(trifluoromethyl)phenyl]-2-phenyl-acetamide::2-[4-(benzenesulfonyl)-1-piperazinyl]-N-[4-chloro-3-(trifluoromethyl)phenyl]-2-phenylacetamide::2-[4-(benzenesulfonyl)piperazin-1-yl]-N-[4-chloro-3-(trifluoromethyl)phenyl]-2-phenylacetamide::N-[4-chloranyl-3-(trifluoromethyl)phenyl]-2-phenyl-2-[4-(phenylsulfonyl)piperazin-1-yl]ethanamide::SR-03000000778-1::cid_4852241
SMILES FC(F)(F)c1cc(NC(=O)C(N2CCN(CC2)S(=O)(=O)c2ccccc2)c2ccccc2)ccc1Cl
InChI Key InChIKey=PXFSNHKBZMNYHH-UHFFFAOYSA-N
Data  2 IC50
  Tab Delimited (TSV)   2D SDfile   Computed 3D by Vconf -m prep SDfile
Find this compound or compounds like it in BindingDB:
Activity Spreadsheet -- Enzyme Inhibition Constant Data from BindingDB
Found 2 hits for monomerid = 67109
TargetSignal transducer and activator of transcription 1-alpha/beta(Homo sapiens (Human))
The Scripps Research Institute Molecular Screening Center
Curated by PubChem BioAssay
LigandPNGBDBM67109(2-(4-besylpiperazino)-N-[4-chloro-3-(trifluorometh...)
Affinity DataIC50: >5.57E+4nM. Assay description: Source (MLPCN Center Name): The Scripps Research Institute Molecular Screening Center Center Affiliation: The Scripps Research Institute (TSRI) Assay...
In DepthDetails PCBioAssay
TargetSignal transducer and activator of transcription 3 [702-738,740-752](Homo sapiens (Human))
The Scripps Research Institute Molecular Screening Center
Curated by PubChem BioAssay
LigandPNGBDBM67109(2-(4-besylpiperazino)-N-[4-chloro-3-(trifluorometh...)
Affinity DataIC50: >5.57E+4nM. Assay description: Source (MLPCN Center Name): The Scripps Research Institute Molecular Screening Center Center Affiliation: The Scripps Research Institute (TSRI) Assay...
In DepthDetails PCBioAssay