BDBM67117 2-(4-besylpiperazino)-N-phenyl-propionamide::2-[4-(benzenesulfonyl)-1-piperazinyl]-N-phenylpropanamide::2-[4-(benzenesulfonyl)piperazin-1-yl]-N-phenylpropanamide::N-phenyl-2-[4-(phenylsulfonyl)piperazin-1-yl]propanamide::SR-03000000786-1::cid_17453313
SMILES CC(N1CCN(CC1)S(=O)(=O)c1ccccc1)C(=O)Nc1ccccc1
InChI Key InChIKey=WIIGESJLIPESNA-UHFFFAOYSA-N
Data  2 IC50
  Tab Delimited (TSV)   2D SDfile   Computed 3D by Vconf -m prep SDfile
Find this compound or compounds like it in BindingDB:
Activity Spreadsheet -- Enzyme Inhibition Constant Data from BindingDB
Found 2 hits for monomerid = 67117
TargetSignal transducer and activator of transcription 1-alpha/beta(Homo sapiens (Human))
The Scripps Research Institute Molecular Screening Center
Curated by PubChem BioAssay
LigandPNGBDBM67117(2-(4-besylpiperazino)-N-phenyl-propionamide | 2-[4...)
Affinity DataIC50: >5.57E+4nM. Assay description: Source (MLPCN Center Name): The Scripps Research Institute Molecular Screening Center Center Affiliation: The Scripps Research Institute (TSRI) Assay...
In DepthDetails PCBioAssay
TargetSignal transducer and activator of transcription 3 [702-738,740-752](Homo sapiens (Human))
The Scripps Research Institute Molecular Screening Center
Curated by PubChem BioAssay
LigandPNGBDBM67117(2-(4-besylpiperazino)-N-phenyl-propionamide | 2-[4...)
Affinity DataIC50: >5.57E+4nM. Assay description: Source (MLPCN Center Name): The Scripps Research Institute Molecular Screening Center Center Affiliation: The Scripps Research Institute (TSRI) Assay...
In DepthDetails PCBioAssay