BDBM67135 2-(4-morpholinylmethyl)-3-[[4-(1H-pyrrol-2-yl)-2-thiazolyl]methyl]-4-quinazolinone::2-(morpholin-4-ylmethyl)-3-[[4-(1H-pyrrol-2-yl)-1,3-thiazol-2-yl]methyl]quinazolin-4-one::2-(morpholinomethyl)-3-[[4-(1H-pyrrol-2-yl)thiazol-2-yl]methyl]quinazolin-4-one::SR-03000000933-1::cid_16361318
SMILES O=c1n(Cc2nc(cs2)-c2ccc[nH]2)c(CN2CCOCC2)nc2ccccc12
InChI Key InChIKey=XTKXDJTVQZGEPL-UHFFFAOYSA-N
Data  2 IC50
  Tab Delimited (TSV)   2D SDfile   Computed 3D by Vconf -m prep SDfile
Find this compound or compounds like it in BindingDB:
Activity Spreadsheet -- Enzyme Inhibition Constant Data from BindingDB
Found 2 hits for monomerid = 67135
TargetSignal transducer and activator of transcription 1-alpha/beta(Homo sapiens (Human))
The Scripps Research Institute Molecular Screening Center
Curated by PubChem BioAssay
LigandPNGBDBM67135(2-(4-morpholinylmethyl)-3-[[4-(1H-pyrrol-2-yl)-2-t...)
Affinity DataIC50:  4.02E+4nM. Assay description: Source (MLPCN Center Name): The Scripps Research Institute Molecular Screening Center Center Affiliation: The Scripps Research Institute (TSRI) Assay...
In DepthDetails PCBioAssay
TargetSignal transducer and activator of transcription 3 [702-738,740-752](Homo sapiens (Human))
The Scripps Research Institute Molecular Screening Center
Curated by PubChem BioAssay
LigandPNGBDBM67135(2-(4-morpholinylmethyl)-3-[[4-(1H-pyrrol-2-yl)-2-t...)
Affinity DataIC50: >5.57E+4nM. Assay description: Source (MLPCN Center Name): The Scripps Research Institute Molecular Screening Center Center Affiliation: The Scripps Research Institute (TSRI) Assay...
In DepthDetails PCBioAssay