BDBM67219 (6E)-6-[(2-methyl-2-phenyl-hydrazinyl)methylidene]-4-nitro-cyclohexa-2,4-dien-1-one::(6E)-6-[(2-methyl-2-phenylhydrazinyl)methylidene]-4-nitro-1-cyclohexa-2,4-dienone::(6E)-6-[(2-methyl-2-phenylhydrazinyl)methylidene]-4-nitrocyclohexa-2,4-dien-1-one::(6E)-6-[(N'-methyl-N'-phenyl-hydrazino)methylene]-4-nitro-cyclohexa-2,4-dien-1-one::2-hydroxy-5-nitrobenzaldehyde methyl(phenyl)hydrazone::MLS000576520::SMR000185904::cid_5367074
SMILES CN(\[NH+]=C\[c-]1cc(ccc1=O)[N+]([O-])=O)c1ccccc1
InChI Key InChIKey=KOTQQFDPMBLZKR-XNTDXEJSSA-O
Data  3 IC50
  Tab Delimited (TSV)   2D SDfile   Computed 3D by Vconf -m prep SDfile
Find this compound or compounds like it in BindingDB:
Activity Spreadsheet -- Enzyme Inhibition Constant Data from BindingDB
Found 3 hits for monomerid = 67219
TargetApelin receptor(Homo sapiens (Human))
Sanford-Burnham Center For Chemical Genomics
Curated by PubChem BioAssay
LigandPNGBDBM67219((6E)-6-[(2-methyl-2-phenyl-hydrazinyl)methylidene]...)
Affinity DataIC50:  3.50E+4nM. Assay description: Data Source: Sanford-Burnham Center for Chemical Genomics (SBCCG) Source Affiliation: Sanford- Sanford-Burnham Medical Research Institute(SBMRI, San...
In DepthDetails PCBioAssay
TargetOrexin/Hypocretin receptor type 1(Homo sapiens (Human))
The Scripps Research Institute Molecular Screening Center
Curated by PubChem BioAssay
LigandPNGBDBM67219((6E)-6-[(2-methyl-2-phenyl-hydrazinyl)methylidene]...)
Affinity DataIC50:  2.48E+3nM. Assay description: Source (MLPCN Center Name): The Scripps Research Institute Molecular Screening Center (SRIMSC) Affiliation: The Scripps Research Institute, TSRI Assa...
In DepthDetails PCBioAssay
TargetOrexin/Hypocretin receptor type 1(Homo sapiens (Human))
The Scripps Research Institute Molecular Screening Center
Curated by PubChem BioAssay
LigandPNGBDBM67219((6E)-6-[(2-methyl-2-phenyl-hydrazinyl)methylidene]...)
Affinity DataIC50:  2.39E+3nM. Assay description: Source (MLPCN Center Name): The Scripps Research Institute Molecular Screening Center (SRIMSC) Affiliation: The Scripps Research Institute, TSRI Assa...
In DepthDetails PCBioAssay