BDBM67475 1-(4-chlorophenyl)-3-[(4-chlorophenyl)carbamoylamino]urea::1-[[(4-chloroanilino)-oxomethyl]amino]-3-(4-chlorophenyl)urea::SR-03000000696-1::cid_5222531
SMILES Clc1ccc(NC(=O)NNC(=O)Nc2ccc(Cl)cc2)cc1
InChI Key InChIKey=YXEULDLHPGRCEJ-UHFFFAOYSA-N
Data  1 IC50
  Tab Delimited (TSV)   2D SDfile   Computed 3D by Vconf -m prep SDfile
Find this compound or compounds like it in BindingDB:
Activity Spreadsheet -- Enzyme Inhibition Constant Data from BindingDB
Found 1 hit for monomerid = 67475
TargetNADPH oxidase 1(Homo sapiens (Human))
The Scripps Research Institute Molecular Screening Center
Curated by PubChem BioAssay
LigandPNGBDBM67475(1-(4-chlorophenyl)-3-[(4-chlorophenyl)carbamoylami...)
Affinity DataIC50: >1.70E+4nM. Assay description: Data Source (MLPCN Center Name): The Scripps Research Institute Molecular Screening Center (SRIMSC) Center Affiliation: The Scripps Research Institut...
In DepthDetails PCBioAssay