BDBM67494 N-[4-(4,5-diphenyl-1H-imidazol-2-yl)phenyl]acetamide::N-[4-(4,5-diphenyl-1H-imidazol-2-yl)phenyl]ethanamide::SR-03000000715-1::cid_1101716
SMILES CC(=O)Nc1ccc(cc1)-c1nc(c([nH]1)-c1ccccc1)-c1ccccc1
InChI Key InChIKey=OUYYMJSSSIVXJK-UHFFFAOYSA-N
Data  1 IC50
  Tab Delimited (TSV)   2D SDfile   Computed 3D by Vconf -m prep SDfile
Find this compound or compounds like it in BindingDB:
Activity Spreadsheet -- Enzyme Inhibition Constant Data from BindingDB
Found 1 hit for monomerid = 67494
TargetNADPH oxidase 1(Homo sapiens (Human))
The Scripps Research Institute Molecular Screening Center
Curated by PubChem BioAssay
LigandPNGBDBM67494(N-[4-(4,5-diphenyl-1H-imidazol-2-yl)phenyl]acetami...)
Affinity DataIC50: >1.70E+4nM. Assay description: Data Source (MLPCN Center Name): The Scripps Research Institute Molecular Screening Center (SRIMSC) Center Affiliation: The Scripps Research Institut...
In DepthDetails PCBioAssay