BDBM67499 (2-acetamidophenyl) 3,6-bis(chloranyl)-1-benzothiophene-2-carboxylate::(2-acetamidophenyl) 3,6-dichloro-1-benzothiophene-2-carboxylate::3,6-dichloro-1-benzothiophene-2-carboxylic acid (2-acetamidophenyl) ester::3,6-dichlorobenzothiophene-2-carboxylic acid (2-acetamidophenyl) ester::SR-03000000720-1::cid_2420632
SMILES CC(=O)Nc1ccccc1OC(=O)c1sc2cc(Cl)ccc2c1Cl
InChI Key InChIKey=CBBTYWQFDMKDBF-UHFFFAOYSA-N
Data  1 IC50
  Tab Delimited (TSV)   2D SDfile   Computed 3D by Vconf -m prep SDfile
Find this compound or compounds like it in BindingDB:
Activity Spreadsheet -- Enzyme Inhibition Constant Data from BindingDB
Found 1 hit for monomerid = 67499
TargetNADPH oxidase 1(Homo sapiens (Human))
The Scripps Research Institute Molecular Screening Center
Curated by PubChem BioAssay
LigandPNGBDBM67499((2-acetamidophenyl) 3,6-bis(chloranyl)-1-benzothio...)
Affinity DataIC50: >1.70E+4nM. Assay description: Data Source (MLPCN Center Name): The Scripps Research Institute Molecular Screening Center (SRIMSC) Center Affiliation: The Scripps Research Institut...
In DepthDetails PCBioAssay