BDBM67528 (4-nitrophenyl) 1-benzothiophene-2-carboxylate::1-benzothiophene-2-carboxylic acid (4-nitrophenyl) ester::SR-03000000750-1::benzothiophene-2-carboxylic acid (4-nitrophenyl) ester::cid_9117950
SMILES [O-][N+](=O)c1ccc(OC(=O)c2cc3ccccc3s2)cc1
InChI Key InChIKey=JMGCMZNZOVRHSR-UHFFFAOYSA-N
Data  1 IC50
  Tab Delimited (TSV)   2D SDfile   Computed 3D by Vconf -m prep SDfile
Find this compound or compounds like it in BindingDB:
Activity Spreadsheet -- Enzyme Inhibition Constant Data from BindingDB
Found 1 hit for monomerid = 67528
TargetNADPH oxidase 1(Homo sapiens (Human))
The Scripps Research Institute Molecular Screening Center
Curated by PubChem BioAssay
LigandPNGBDBM67528((4-nitrophenyl) 1-benzothiophene-2-carboxylate | 1...)
Affinity DataIC50: >1.70E+4nM. Assay description: Data Source (MLPCN Center Name): The Scripps Research Institute Molecular Screening Center (SRIMSC) Center Affiliation: The Scripps Research Institut...
In DepthDetails PCBioAssay