BDBM67602 (1-methyl-2-benzimidazolyl)-phenyldiazene::(1-methylbenzimidazol-2-yl)-phenyl-diazene::(1-methylbenzimidazol-2-yl)-phenyldiazene::1-methyl-2-(phenyldiazenyl)-1H-benzimidazole::MLS000700530::SMR000225110::cid_5210304
SMILES Cn1c(\N=N\c2ccccc2)nc2ccccc12
InChI Key InChIKey=INKMRFJWZYZHIL-WUKNDPDISA-N
Data  1 EC50
  Tab Delimited (TSV)   2D SDfile   Computed 3D by Vconf -m prep SDfile
Find this compound or compounds like it in BindingDB:
Activity Spreadsheet -- Enzyme Inhibition Constant Data from BindingDB
Found 1 hit for monomerid = 67602
TargetSerine/threonine-protein kinase 33(Homo sapiens (Human))
Broad Institute
Curated by PubChem BioAssay
LigandPNGBDBM67602((1-methyl-2-benzimidazolyl)-phenyldiazene | (1-met...)
Affinity DataEC50: >1.20E+5nM. Assay description: Keywords: STK33 Kinase, Non-ATP Competitive Inhibitor Assay Overview: Purified STK33 Kinase is preincubated with potential inhibitors and allowed to ...
In DepthDetails PCBioAssay