BDBM67646 2-chloro-4-methyl-benzoic acid [(Z)-[amino(2-pyridyl)methylene]amino] ester::2-chloro-4-methylbenzoic acid [(Z)-[amino(2-pyridinyl)methylidene]amino] ester::MLS001206211::SMR000523773::The compound has not trivial name.::[(Z)-[amino(pyridin-2-yl)methylidene]amino] 2-chloro-4-methylbenzoate::[(Z)-[azanyl(pyridin-2-yl)methylidene]amino] 2-chloranyl-4-methyl-benzoate::cid_9586790
SMILES Cc1ccc(C(=O)ON=C(N)c2ccccn2)c(Cl)c1
InChI Key InChIKey=BVJVZKQFDVHEOM-UHFFFAOYSA-N
Data  3 IC50  2 EC50
  Tab Delimited (TSV)   2D SDfile   Computed 3D by Vconf -m prep SDfile
Find this compound or compounds like it in BindingDB:
Activity Spreadsheet -- Enzyme Inhibition Constant Data from BindingDB
Found 5 hits for monomerid = 67646
TargetSerine/threonine-protein kinase 33(Homo sapiens (Human))
Broad Institute
Curated by PubChem BioAssay
LigandPNGBDBM67646(2-chloro-4-methyl-benzoic acid [(Z)-[amino(2-pyrid...)
Affinity DataEC50:  3.22E+4nM. Assay description: Keywords: STK33 Kinase, Non-ATP Competitive Inhibitor Assay Overview: Purified STK33 Kinase is preincubated with potential inhibitors and allowed to ...
In DepthDetails PCBioAssay
TargetGlycogen synthase kinase-3 beta(Homo sapiens (Human))
Broad Institute
Curated by PubChem BioAssay
LigandPNGBDBM67646(2-chloro-4-methyl-benzoic acid [(Z)-[amino(2-pyrid...)
Affinity DataEC50:  2.62E+4nM. Assay description: Keywords: GSK3beta, dose response, kinase, inhibition, HTS Assay Overview: The glycogen synthase kinase-3 beta (GSK-3b) is a known master regulator f...
In DepthDetails PCBioAssay
TargetNuclear receptor coactivator 1(Homo sapiens (Human))
The Scripps Research Institute Molecular Screening Center
Curated by PubChem BioAssay
LigandPNGBDBM67646(2-chloro-4-methyl-benzoic acid [(Z)-[amino(2-pyrid...)
Affinity DataIC50: >3.59E+4nM. Assay description: Source (MLPCN Center Name): The Scripps Research Institute Molecular Screening Center (SRIMSC) Affiliation: The Scripps Research Institute, TSRI Assa...
In DepthDetails PCBioAssay
TargetTegument protein VP16(Human herpesvirus 1 (strain 17) (HHV-1) (Human her...)
The Scripps Research Institute Molecular Screening Center
Curated by PubChem BioAssay
LigandPNGBDBM67646(2-chloro-4-methyl-benzoic acid [(Z)-[amino(2-pyrid...)
Affinity DataIC50:  1.28E+4nM. Assay description: Source (MLPCN Center Name): The Scripps Research Institute Molecular Screening Center (SRIMSC) Affiliation: The Scripps Research Institute, TSRI Assa...
In DepthDetails PCBioAssay
TargetNuclear receptor coactivator 3(Homo sapiens (Human))
The Scripps Research Institute Molecular Screening Center
Curated by PubChem BioAssay
LigandPNGBDBM67646(2-chloro-4-methyl-benzoic acid [(Z)-[amino(2-pyrid...)
Affinity DataIC50: >3.59E+4nM. Assay description: Source (MLPCN Center Name): The Scripps Research Institute Molecular Screening Center (SRIMSC) Affiliation: The Scripps Research Institute, TSRI Assa...
In DepthDetails PCBioAssay