BDBM68345 4-(3-methoxy-4-oxidanyl-phenyl)-2,7,7-trimethyl-3-piperidin-1-ylcarbonyl-1,4,6,8-tetrahydroquinolin-5-one::4-(4-Hydroxy-3-methoxy-phenyl)-2,7,7-trimethyl-3-(piperidine-1-carbonyl)-4,6,7,8-tetrahydro-1H-quinolin-5-one::4-(4-hydroxy-3-methoxy-phenyl)-2,7,7-trimethyl-3-(piperidine-1-carbonyl)-1,4,6,8-tetrahydroquinolin-5-one::4-(4-hydroxy-3-methoxyphenyl)-2,7,7-trimethyl-3-(piperidine-1-carbonyl)-1,4,6,8-tetrahydroquinolin-5-one::4-(4-hydroxy-3-methoxyphenyl)-2,7,7-trimethyl-3-[oxo(1-piperidinyl)methyl]-1,4,6,8-tetrahydroquinolin-5-one::MLS000076636::SMR000015149::cid_645400
SMILES COc1cc(ccc1O)C1C2C(=O)CC(C)(C)CC2=NC(C)=C1C(=O)N1CCCCC1
InChI Key InChIKey=DOHAFUYYATUHNR-UHFFFAOYSA-N
Data  1 EC50
  Tab Delimited (TSV)   2D SDfile   Computed 3D by Vconf -m prep SDfile
Find this compound or compounds like it in BindingDB:
Activity Spreadsheet -- Enzyme Inhibition Constant Data from BindingDB
Found 1 hit for monomerid = 68345
TargetGlycogen synthase kinase-3 beta(Homo sapiens (Human))
Broad Institute
Curated by PubChem BioAssay
LigandPNGBDBM68345(4-(3-methoxy-4-oxidanyl-phenyl)-2,7,7-trimethyl-3-...)
Affinity DataEC50: >3.00E+5nM. Assay description: Keywords: GSK3beta, dose response, kinase, inhibition, HTS Assay Overview: The glycogen synthase kinase-3 beta (GSK-3b) is a known master regulator f...
In DepthDetails PCBioAssay