BDBM69753 4-N-(2-methoxyphenyl)-5-nitro-2-N-prop-2-enylpyrimidine-2,4,6-triamine::MLS001213424::N4-(2-methoxyphenyl)-5-nitro-N2-prop-2-enyl-pyrimidine-2,4,6-triamine::N4-(2-methoxyphenyl)-5-nitro-N2-prop-2-enylpyrimidine-2,4,6-triamine::SMR000540499::allyl-[4-amino-5-nitro-6-(o-anisidino)pyrimidin-2-yl]amine::cid_3541811
SMILES COc1ccccc1Nc1nc(NCC=C)nc(N)c1[N+]([O-])=O
InChI Key InChIKey=PYLUOPUVSPZRAE-UHFFFAOYSA-N
Data  1 EC50
  Tab Delimited (TSV)   2D SDfile   Computed 3D by Vconf -m prep SDfile
Find this compound or compounds like it in BindingDB:
Activity Spreadsheet -- Enzyme Inhibition Constant Data from BindingDB
Found 1 hit for monomerid = 69753
TargetGlycogen synthase kinase-3 beta(Homo sapiens (Human))
Broad Institute
Curated by PubChem BioAssay
LigandPNGBDBM69753(4-N-(2-methoxyphenyl)-5-nitro-2-N-prop-2-enylpyrim...)
Affinity DataEC50: >3.00E+5nM. Assay description: Keywords: GSK3beta, dose response, kinase, inhibition, HTS Assay Overview: The glycogen synthase kinase-3 beta (GSK-3b) is a known master regulator f...
In DepthDetails PCBioAssay