BDBM70256 3-Chloro-1-(4-chloro-phenyl)-4-(4-methyl-piperazin-1-yl)-pyrrole-2,5-dione::3-chloranyl-1-(4-chlorophenyl)-4-(4-methylpiperazin-1-yl)pyrrole-2,5-dione::3-chloro-1-(4-chlorophenyl)-4-(4-methyl-1-piperazinyl)pyrrole-2,5-dione::3-chloro-1-(4-chlorophenyl)-4-(4-methylpiperazin-1-yl)pyrrole-2,5-dione::3-chloro-1-(4-chlorophenyl)-4-(4-methylpiperazino)-3-pyrroline-2,5-quinone::MLS000070448::SMR000011095::cid_648594
SMILES CN1CCN(CC1)C1=C(Cl)C(=O)N(C1=O)c1ccc(Cl)cc1
InChI Key InChIKey=IJEJQSJVZKNZTB-UHFFFAOYSA-N
Data  2 EC50
  Tab Delimited (TSV)   2D SDfile   Computed 3D by Vconf -m prep SDfile
Find this compound or compounds like it in BindingDB:
Activity Spreadsheet -- Enzyme Inhibition Constant Data from BindingDB
Found 2 hits for monomerid = 70256
TargetProtein RecA(Mycobacterium tuberculosis H37Rv)
Broad Institute
Curated by PubChem BioAssay
LigandPNGBDBM70256(3-Chloro-1-(4-chloro-phenyl)-4-(4-methyl-piperazin...)
Affinity DataEC50:  247nM. Assay description: Keywords: GFP-RecA intein, protein splicing, refolding, reducing reagent, GFP fluorescence Assay Overview: M. tuberculosis harbors three inteins, whi...
In DepthDetails PCBioAssay
TargetProtein RecA(Mycobacterium tuberculosis H37Rv)
Broad Institute
Curated by PubChem BioAssay
LigandPNGBDBM70256(3-Chloro-1-(4-chloro-phenyl)-4-(4-methyl-piperazin...)
Affinity DataEC50:  160nM. Assay description: Keywords: GFP, refolding, reducing reagent, GFP fluorescence Assay Overview: M. tuberculosis harbors three inteins, which interrupt the DnaB, RecA, a...
In DepthDetails PCBioAssay