BDBM70702 Chloro-acetic acid N'-(2-hydroxy-2,2-diphenyl-acetyl)-N-p-tolyl-hydrazide::MLS000589422::N'-(2-chloranylethanoyl)-N'-(4-methylphenyl)-2-oxidanyl-2,2-diphenyl-ethanehydrazide::N'-(2-chloro-1-oxoethyl)-2-hydroxy-N'-(4-methylphenyl)-2,2-diphenylacetohydrazide::N'-(2-chloroacetyl)-2-hydroxy-2,2-diphenyl-N'-(p-tolyl)acetohydrazide::N'-(2-chloroacetyl)-2-hydroxy-N'-(4-methylphenyl)-2,2-diphenylacetohydrazide::SMR000212821::cid_1920377
SMILES Cc1ccc(cc1)N(NC(=O)C(O)(c1ccccc1)c1ccccc1)C(=O)CCl
InChI Key InChIKey=UUKQACYZIYDMIY-UHFFFAOYSA-N
Data  1 IC50  1 EC50
  Tab Delimited (TSV)   2D SDfile   Computed 3D by Vconf -m prep SDfile
Find this compound or compounds like it in BindingDB:
Activity Spreadsheet -- Enzyme Inhibition Constant Data from BindingDB
Found 2 hits for monomerid = 70702
TargetProtein RecA(Mycobacterium tuberculosis H37Rv)
Southern Research Specialized Biocontainment Screening Center
Curated by PubChem BioAssay
LigandPNGBDBM70702(Chloro-acetic acid N'-(2-hydroxy-2,2-diphenyl-...)
Affinity DataIC50:  1.20E+4nM. Assay description: Southern Research's Specialized Biocontainment Screening Center (SRSBSC) Southern Research Institute (Birmingham, Alabama) NIH Molecular Librarie...
In DepthDetails PCBioAssay
TargetHeat shock factor protein 1(Mus musculus)
Broad Institute
Curated by PubChem BioAssay
LigandPNGBDBM70702(Chloro-acetic acid N'-(2-hydroxy-2,2-diphenyl-...)
Affinity DataEC50: >2.60E+5nM. Assay description: Keywords: Heat Shock Factor-1 (HSF-1), Stress Response, MG132, NIH3T3, Luminescence Assay Overview: Confirmation testing of small molecules identifie...
In DepthDetails PCBioAssay