BDBM71591 KSC-11-42-1::KUC104172N::N-[2-(dibenzylamino)ethyl]-4-[[(4-methoxyphenyl)sulfonylamino]methyl]benzamide::N-[2-[bis(phenylmethyl)amino]ethyl]-4-[[(4-methoxyphenyl)sulfonylamino]methyl]benzamide::cid_44620905
SMILES COc1ccc(cc1)S(=O)(=O)NCc1ccc(cc1)C(=O)NCCN(Cc1ccccc1)Cc1ccccc1
InChI Key InChIKey=OBDWBAUKBRIENL-UHFFFAOYSA-N
Data  4 IC50
  Tab Delimited (TSV)   2D SDfile   Computed 3D by Vconf -m prep SDfile
Find this compound or compounds like it in BindingDB:
Activity Spreadsheet -- Enzyme Inhibition Constant Data from BindingDB
Found 4 hits for monomerid = 71591
TargetKappa-type opioid receptor(Homo sapiens (Human))
Burnham Center For Chemical Genomics
Curated by PubChem BioAssay
LigandPNGBDBM71591(KSC-11-42-1 | KUC104172N | N-[2-(dibenzylamino)eth...)
Affinity DataIC50: >2.00E+4nM. Assay description: Data Source: Burnham Center for Chemical Genomics (BCCG) Source Affiliation: Burnham Institute for Medical Research (BIMR, La Jolla, CA) Network: NIH...
In DepthDetails PCBioAssay
TargetMu-type opioid receptor(Homo sapiens (Human))
Burnham Center For Chemical Genomics
Curated by PubChem BioAssay
LigandPNGBDBM71591(KSC-11-42-1 | KUC104172N | N-[2-(dibenzylamino)eth...)
Affinity DataIC50: >3.20E+4nM. Assay description: Data Source: Sanford-Burnham Center for Chemical Genomics (SBCCG) Source Affiliation: Sanford-Burnham Medical Research Institute (SBMRI, San Diego, C...
In DepthDetails PCBioAssay
TargetDelta-type opioid receptor(Homo sapiens (Human))
Burnham Center For Chemical Genomics
Curated by PubChem BioAssay
LigandPNGBDBM71591(KSC-11-42-1 | KUC104172N | N-[2-(dibenzylamino)eth...)
Affinity DataIC50: >3.20E+4nM. Assay description: Data Source: Sanford-Burnham Center for Chemical Genomics (SBCCG) Source Affiliation: Sanford-Burnham Medical Research Institute (SBMRI, San Diego, C...
In DepthDetails PCBioAssay
TargetKappa-type opioid receptor(Homo sapiens (Human))
Burnham Center For Chemical Genomics
Curated by PubChem BioAssay
LigandPNGBDBM71591(KSC-11-42-1 | KUC104172N | N-[2-(dibenzylamino)eth...)
Affinity DataIC50:  1.31E+4nM. Assay description: Data Source: Sanford-Burnham Center for Chemical Genomics (SBCCG) Source Affiliation: Sanford-Burnham Medical Research Institute (SBMRI, San Diego, C...
In DepthDetails PCBioAssay