BDBM71616 KSC-1-270::KUC104545N::cid_44828476
SMILES Clc1ccc(cc1)N1CCN(CCCNC(=O)Cn2c3ncccc3n3cccc3c2=O)CC1
InChI Key InChIKey=GESGZCWZXRTSCL-UHFFFAOYSA-N
Data  5 IC50
  Tab Delimited (TSV)   2D SDfile   Computed 3D by Vconf -m prep SDfile
Find this compound or compounds like it in BindingDB:
Activity Spreadsheet -- Enzyme Inhibition Constant Data from BindingDB
Found 5 hits for monomerid = 71616
TargetKappa-type opioid receptor(Homo sapiens (Human))
Burnham Center For Chemical Genomics
Curated by PubChem BioAssay
LigandPNGBDBM71616(KSC-1-270 | KUC104545N | cid_44828476)
Affinity DataIC50:  3.44E+3nM. Assay description: Data Source: Burnham Center for Chemical Genomics (BCCG) Source Affiliation: Burnham Institute for Medical Research (BIMR, La Jolla, CA) Network: NIH...
In DepthDetails PCBioAssay
TargetKappa-type opioid receptor(Homo sapiens (Human))
Burnham Center For Chemical Genomics
Curated by PubChem BioAssay
LigandPNGBDBM71616(KSC-1-270 | KUC104545N | cid_44828476)
Affinity DataIC50:  96nM. Assay description: Data Source: Sanford-Burnham Center for Chemical Genomics (SBCCG) Source Affiliation: Sanford-Burnham Medical Research Institute (SBMRI, San Diego, C...
In DepthDetails PCBioAssay
TargetMu-type opioid receptor(Homo sapiens (Human))
Burnham Center For Chemical Genomics
Curated by PubChem BioAssay
LigandPNGBDBM71616(KSC-1-270 | KUC104545N | cid_44828476)
Affinity DataIC50: >3.20E+4nM. Assay description: Data Source: Sanford-Burnham Center for Chemical Genomics (SBCCG) Source Affiliation: Sanford-Burnham Medical Research Institute (SBMRI, San Diego, C...
In DepthDetails PCBioAssay
TargetDelta-type opioid receptor(Homo sapiens (Human))
Burnham Center For Chemical Genomics
Curated by PubChem BioAssay
LigandPNGBDBM71616(KSC-1-270 | KUC104545N | cid_44828476)
Affinity DataIC50: >3.20E+4nM. Assay description: Data Source: Sanford-Burnham Center for Chemical Genomics (SBCCG) Source Affiliation: Sanford-Burnham Medical Research Institute (SBMRI, San Diego, C...
In DepthDetails PCBioAssay
TargetKappa-type opioid receptor(Homo sapiens (Human))
Burnham Center For Chemical Genomics
Curated by PubChem BioAssay
LigandPNGBDBM71616(KSC-1-270 | KUC104545N | cid_44828476)
Affinity DataIC50:  6.93E+3nM. Assay description: Data Source: Sanford-Burnham Center for Chemical Genomics (SBCCG) Source Affiliation: Sanford-Burnham Medical Research Institute (SBMRI, San Diego, C...
In DepthDetails PCBioAssay