BDBM71756 MLS000089513::N-[3-(N-ethyl-3-methyl-anilino)propyl]-2-[(2-keto-1-methyl-4-quinolyl)oxy]acetamide::N-[3-(N-ethyl-3-methylanilino)propyl]-2-(1-methyl-2-oxoquinolin-4-yl)oxyacetamide::N-[3-(N-ethyl-3-methylanilino)propyl]-2-[(1-methyl-2-oxo-4-quinolinyl)oxy]acetamide::N-[3-[ethyl-(3-methylphenyl)amino]propyl]-2-(1-methyl-2-oxidanylidene-quinolin-4-yl)oxy-ethanamide::N-{3-[ethyl(3-methylphenyl)amino]propyl}-2-[(1-methyl-2-oxo-1,2-dihydroquinolin-4-yl)oxy]acetamide::SMR000027861::cid_3238183
SMILES CCN(CCCNC(=O)COc1cc(=O)n(C)c2ccccc12)c1cccc(C)c1
InChI Key InChIKey=VFIZUXWCLDZLDI-UHFFFAOYSA-N
Data  1 EC50
  Tab Delimited (TSV)   2D SDfile   Computed 3D by Vconf -m prep SDfile
Find this compound or compounds like it in BindingDB:
Activity Spreadsheet -- Enzyme Inhibition Constant Data from BindingDB
Found 1 hit for monomerid = 71756
TargetHeat shock factor protein 1(Mus musculus)
Broad Institute
Curated by PubChem BioAssay
LigandPNGBDBM71756(MLS000089513 | N-[3-(N-ethyl-3-methyl-anilino)prop...)
Affinity DataEC50: >2.60E+5nM. Assay description: Keywords: Heat Shock Factor-1 (HSF-1), Stress Response, MG132, NIH3T3, Luminescence Assay Overview: Confirmation testing of small molecules identifie...
In DepthDetails PCBioAssay