BDBM71950 (E)-3-(2,6,6-trimethyl-1-cyclohexenyl)-2-propenoic acid::(E)-3-(2,6,6-trimethylcyclohexen-1-yl)acrylic acid::(E)-3-(2,6,6-trimethylcyclohexen-1-yl)prop-2-enoic acid::3-(2,6,6-trimethyl-1-cyclohexen-1-yl)acrylic acid::MLS000530307::SMR000135283::cid_5383969
SMILES CC1=C(\C=C\C(O)=O)C(C)(C)CCC1
InChI Key InChIKey=RCVGWZAQWMJQHG-VOTSOKGWSA-N
Data  1 EC50
  Tab Delimited (TSV)   2D SDfile   Computed 3D by Vconf -m prep SDfile
Find this compound or compounds like it in BindingDB:
Activity Spreadsheet -- Enzyme Inhibition Constant Data from BindingDB
Found 1 hit for monomerid = 71950
TargetHeat shock factor protein 1(Mus musculus)
Broad Institute
Curated by PubChem BioAssay
LigandPNGBDBM71950((E)-3-(2,6,6-trimethyl-1-cyclohexenyl)-2-propenoic...)
Affinity DataEC50: >2.60E+5nM. Assay description: Keywords: Heat Shock Factor-1 (HSF-1), Stress Response, MG132, NIH3T3, Luminescence Assay Overview: Confirmation testing of small molecules identifie...
In DepthDetails PCBioAssay