BDBM73210 (5Z)-5-{(2E)-3-[4-(dimethylamino)phenyl]-1-hydroxyprop-2-enylidene}-2,3-dimethyl-2,3,5,6-tetrahydro-4H-2,6-methano-1,3-benzoxazocin-4-one::MLS000094859::SMR000030412::cid_5771267
SMILES [H]C12CC(C)(Oc3ccccc13)N(C)C(O)=C2C(=O)\C=C\c1ccc(cc1)N(C)C
InChI Key InChIKey=FTSNQPKFBXLCCS-SDNWHVSQSA-N
Data  1 EC50
  Tab Delimited (TSV)   2D SDfile   Computed 3D by Vconf -m prep SDfile
Find this compound or compounds like it in BindingDB:
Activity Spreadsheet -- Enzyme Inhibition Constant Data from BindingDB
Found 1 hit for monomerid = 73210
TargetG protein-activated inward rectifier potassium channel 1(Rattus norvegicus)
Vanderbilt Screening Center For Gpcrs, Ion Channels And Transporters
Curated by PubChem BioAssay
LigandPNGBDBM73210((5Z)-5-{(2E)-3-[4-(dimethylamino)phenyl]-1-hydroxy...)
Affinity DataEC50:  0.856nM. Assay description: Assay Provider: Colleen Niswender Assay Provider Affliation: Vanderbilt University Grant Title: Measurement of GPCR-mediated thallium flux through GI...
In DepthDetails PCBioAssay