BDBM73258 7-(3-bromobenzyl)-8-(3-imidazol-1-ylpropylamino)-3-methyl-xanthine::7-[(3-bromophenyl)methyl]-8-(3-imidazol-1-ylpropylamino)-3-methyl-purine-2,6-dione::7-[(3-bromophenyl)methyl]-8-(3-imidazol-1-ylpropylamino)-3-methylpurine-2,6-dione::7-[(3-bromophenyl)methyl]-8-[3-(1-imidazolyl)propylamino]-3-methylpurine-2,6-dione::MLS000040668::SMR000059810::cid_663582
SMILES Cn1c2nc(NCCCn3ccnc3)n(Cc3cccc(Br)c3)c2c(=O)[nH]c1=O
InChI Key InChIKey=YYVSVNOLFFJYOH-UHFFFAOYSA-N
Data  1 EC50
  Tab Delimited (TSV)   2D SDfile   Computed 3D by Vconf -m prep SDfile
Find this compound or compounds like it in BindingDB:
Activity Spreadsheet -- Enzyme Inhibition Constant Data from BindingDB
Found 1 hit for monomerid = 73258
TargetProtein LANA1(Human herpesvirus 8)
Broad Institute
Curated by PubChem BioAssay
LigandPNGBDBM73258(7-(3-bromobenzyl)-8-(3-imidazol-1-ylpropylamino)-3...)
Affinity DataEC50: >7.50E+4nM. Assay description: Primary Collaborators: Kenneth Kaye,Brigham & Womens,Boston MA,kkaye@rics.bwh.harvard.edu,617-525-4256 Chantal Beauchemin,Brigham & Womens,Boston MA,...
In DepthDetails PCBioAssay